program: Orca
programVersion: 5.0.2
elementType: Cl Cl Cl Cl P O O O O C C C C C C C C C C H H H H H H H H H
charge: 0
multiplicity: 1
keywords: wb97x-d3
keywords: def2-TZVPP
keywords: def2/J RIJCOSX
keywords: DEFGRID2
keywords: scfconv7
keywords: smallprint printgap noloewdin
keywords: NOSOSCF
formula: C10H9Cl4O4P
InChI: InChI=1/C10H9Cl4O4P/c1-16-19(15,17-2)18-10(5-11)6-3-8(13)9(14)4-7(6)12/h3-5H,1-2H3
28 atoms
Cl -0.264313 -0.487956 2.690399
Cl 3.558371 0.181826 -2.151473
Cl 4.250946 -1.825604 0.173879
Cl -2.198549 3.654572 0.247574
P  -2.370298 -0.388444 -0.739008
O  -1.972014 0.705438 0.39892
O  -1.463193 -1.640476 -0.335386
O  -3.825361 -0.763434 -0.24882
O  -2.255912 0.067406 -2.124325
C  0.452436 0.593373 0.315343
C  -0.794167 1.382731 0.329752
C  0.776261 -0.301577 1.335336
C  1.327387 0.716868 -0.755622
C  2.508015 -0.008609 -0.810416
C  1.943876 -1.038987 1.287975
C  2.812626 -0.894922 0.215069
C  -0.776137 2.710093 0.296658
C  -0.669797 -2.353215 -1.279111
C  -4.10824 -1.209061 1.073639
H  1.070211 1.378009 -1.5720
H  2.188572 -1.723953 2.087237
H  0.154361 3.258514 0.319894
H  -0.595987 -1.828629 -2.230298
H  -1.10705 -3.336963 -1.447706
H  0.32694 -2.473465 -0.856915
H  -3.959629 -0.408852 1.798572
H  -3.49133 -2.064109 1.352007
H  -5.15284 -1.509268 1.084849
totalener: -2869.73993677 hartree
nucrepener: 2306.85805493 hartree
electener: -5176.59799171 hartree
oneelecener: -8546.77287795 hartree
twoeener: 3370.17488625 hartree
kineticenergy: 2863.55345039 hartree
xcener: -165.293239756682 hartree
chargesum: 0.0000000
charge: -0.040431 -0.030940 -0.033365 -0.048938 0.873110 -0.320627 -0.331345 -0.315862 -0.496658 -0.024666 0.156920 0.090077 -0.143887 0.059451 -0.137850 0.013396 -0.105995 -0.111430 -0.125112 0.140017 0.115219 0.125296 0.126725 0.124135 0.095160 0.116689 0.109687 0.121225
qa: -0.0404 -0.0309 -0.0334 -0.0489 0.8731 -0.3206 -0.3313 -0.3159 -0.4967 -0.0247 0.1569 0.0901 -0.1439 0.0595 -0.1379 0.0134 -0.1060 -0.1114 -0.1251 0.1400 0.1152 0.1253 0.1267 0.1241 0.0952 0.1167 0.1097 0.1212
va: 1.2834 1.2871 1.2820 1.2654 5.6264 2.1060 2.0488 2.1535 2.1329 3.7348 3.8340 3.8812 3.9858 3.9675 4.0426 3.9814 4.1240 3.8652 3.8642 1.0170 1.0282 1.0104 1.0015 0.9958 0.9801 0.9919 0.9939 0.9915
dispcorr: -0.018358704 hartree
energy: -2869.758295478801
dipole: -15.08138 15.49430 0.41292 -9.90503 8.96874 -0.93630 -0.15346 1.18921 1.03575
magnitude: 1.45600 au
magnitude: 3.70086 debye
