program: Orca
programVersion: 5.0.2
elementType: Cl Cl Cl Cl P O O O O C C C C C C C C C C H H H H H H H H H
charge: 0
multiplicity: 1
keywords: wb97x-d3
keywords: def2-TZVPP
keywords: def2/J RIJCOSX
keywords: DEFGRID2
keywords: scfconv7
keywords: smallprint printgap noloewdin
keywords: NOSOSCF
formula: C10H9Cl4O4P
InChI: InChI=1/C10H9Cl4O4P/c1-16-19(15,17-2)18-10(5-11)6-3-8(13)9(14)4-7(6)12/h3-5H,1-2H3
28 atoms
Cl -0.412132 -1.196238 -2.565027
Cl 3.523746 0.740781 1.819862
Cl 4.23807 -1.735747 0.014903
Cl -2.494392 3.206773 -1.461246
P  -2.12031 -0.214623 1.131883
O  -2.067194 0.509223 -0.326625
O  -3.681336 -0.388838 1.302717
O  -1.568483 -1.675789 0.792548
O  -1.441081 0.491172 2.220462
C  0.348354 0.45346 -0.569453
C  -0.941025 1.157641 -0.732478
C  0.673459 -0.655134 -1.34837
C  1.244217 0.864918 0.407463
C  2.449048 0.20611 0.59677
C  1.869502 -1.32437 -1.167637
C  2.760468 -0.893245 -0.195715
C  -1.016752 2.363138 -1.279163
C  -4.530307 -0.931292 0.296767
C  -0.570049 -2.288205 1.60432
H  0.983836 1.698145 1.044683
H  2.116863 -2.176881 -1.783944
H  -0.13769 2.860721 -1.661368
H  -4.613056 -0.252992 -0.552163
H  -5.510905 -1.054358 0.749418
H  -4.17639 -1.902936 -0.050039
H  -0.275797 -3.20215 1.094063
H  -0.958782 -2.538723 2.591797
H  0.303803 -1.647812 1.723453
totalener: -2869.74033592 hartree
nucrepener: 2306.57245697 hartree
electener: -5176.31279289 hartree
oneelecener: -8546.38003162 hartree
twoeener: 3370.06723872 hartree
kineticenergy: 2863.55024865 hartree
xcener: -165.291551561799 hartree
chargesum: 0.0000000
charge: -0.035569 -0.031890 -0.033190 -0.059246 0.878896 -0.314832 -0.318557 -0.330922 -0.497192 -0.076632 0.164365 0.092627 -0.085040 0.027642 -0.153534 0.041804 -0.096443 -0.121845 -0.132009 0.129851 0.115617 0.122278 0.117406 0.117400 0.110979 0.120203 0.130920 0.116911
qa: -0.0356 -0.0319 -0.0332 -0.0592 0.8789 -0.3148 -0.3186 -0.3309 -0.4972 -0.0766 0.1644 0.0926 -0.0850 0.0276 -0.1535 0.0418 -0.0964 -0.1218 -0.1320 0.1299 0.1156 0.1223 0.1174 0.1174 0.1110 0.1202 0.1309 0.1169
va: 1.2881 1.2834 1.2836 1.2519 5.6148 2.1187 2.1593 2.0463 2.1208 3.7428 3.8444 3.9021 3.9591 3.9655 4.0509 3.9744 4.1092 3.8658 3.8717 1.0297 1.0276 1.0131 0.9929 0.9897 0.9932 0.9862 0.9965 0.9816
dispcorr: -0.018401669 hartree
energy: -2869.758737590903
dipole: -16.14789 16.03066 -0.11723 -8.84386 7.74790 -1.09596 4.97630 -5.70633 -0.73003
magnitude: 1.32205 au
magnitude: 3.36038 debye
