program: Orca
programVersion: 5.0.2
elementType: Cl Cl Cl Cl P O O O O C C C C C C C C C C H H H H H H H H H
charge: 0
multiplicity: 1
keywords: wb97x-d3
keywords: def2-TZVPP
keywords: def2/J RIJCOSX
keywords: DEFGRID2
keywords: scfconv7
keywords: smallprint printgap noloewdin
keywords: NOSOSCF
formula: C10H9Cl4O4P
InChI: InChI=1/C10H9Cl4O4P/c1-16-19(15,17-2)18-10(5-11)6-3-8(13)9(14)4-7(6)12/h3-5H,1-2H3
28 atoms
Cl 0.489888 -1.77472 2.146495
Cl 3.039309 1.847932 -2.197296
Cl 4.470833 -0.805983 -1.279947
Cl -2.346527 2.460751 2.485899
P  -2.132093 -0.829123 -0.468135
O  -1.874342 0.028465 0.883876
O  -3.693855 -1.081401 -0.337806
O  -2.03833 0.31269 -1.570234
O  -1.290318 -2.014713 -0.663779
C  0.518529 0.379164 0.51963
C  -0.774425 0.797071 1.096911
C  1.168942 -0.787117 0.919339
C  1.116145 1.172862 -0.449696
C  2.336232 0.829465 -1.008522
C  2.382548 -1.145665 0.363874
C  2.966511 -0.341028 -0.603116
C  -0.868436 1.900916 1.829416
C  -4.178468 -2.141423 0.483411
C  -1.690058 -0.013602 -2.913753
H  0.613124 2.07217 -0.777314
H  2.881564 -2.049431 0.682815
H  0.00523 2.491254 2.063147
H  -3.66752 -3.080204 0.268283
H  -5.237777 -2.250569 0.264777
H  -4.059429 -1.90036 1.540725
H  -1.519532 0.928627 -3.428237
H  -2.50195 -0.545494 -3.411931
H  -0.784664 -0.618661 -2.957069
totalener: -2869.74097897 hartree
nucrepener: 2286.40727588 hartree
electener: -5156.14825484 hartree
oneelecener: -8506.49342899 hartree
twoeener: 3350.34517415 hartree
kineticenergy: 2863.55046719 hartree
xcener: -165.289957158787 hartree
chargesum: -0.0000000
charge: -0.034923 -0.041392 -0.036864 -0.061074 0.882358 -0.297834 -0.325770 -0.326261 -0.503517 0.033291 0.157877 0.060930 -0.190000 0.064890 -0.117553 0.028129 -0.115592 -0.131261 -0.131170 0.129647 0.112820 0.126697 0.118902 0.116295 0.117800 0.118617 0.121906 0.123053
qa: -0.0349 -0.0414 -0.0369 -0.0611 0.8824 -0.2978 -0.3258 -0.3263 -0.5035 0.0333 0.1579 0.0609 -0.1900 0.0649 -0.1176 0.0281 -0.1156 -0.1313 -0.1312 0.1296 0.1128 0.1267 0.1189 0.1163 0.1178 0.1186 0.1219 0.1231
va: 1.2885 1.2771 1.2798 1.2507 5.6406 2.1566 2.1407 2.0942 2.0905 3.7170 3.8602 3.9700 3.9718 3.9464 4.0716 4.0064 4.0810 3.8652 3.8607 1.0236 1.0264 1.0114 0.9938 0.9899 0.9889 0.9889 0.9920 0.9931
dispcorr: -0.016750278 hartree
energy: -2869.757729245259
dipole: -19.28564 18.87341 -0.41223 -6.23098 6.24872 0.01774 -6.53473 6.17769 -0.35704
magnitude: 0.54564 au
magnitude: 1.38692 debye
