program: Orca
programVersion: 5.0.2
elementType: Cl Cl Cl Cl P O O O O C C C C C C C C C C H H H H H H H H H
charge: 0
multiplicity: 1
keywords: wb97x-d3
keywords: def2-TZVPP
keywords: def2/J RIJCOSX
keywords: DEFGRID2
keywords: scfconv7
keywords: smallprint printgap noloewdin
keywords: NOSOSCF
formula: C10H9Cl4O4P
InChI: InChI=1/C10H9Cl4O4P/c1-16-19(15,17-2)18-10(5-11)6-3-8(13)9(14)4-7(6)12/h3-5H,1-2H3
28 atoms
Cl 0.287905 -2.613565 -1.565766
Cl 2.711691 2.669595 0.617132
Cl 3.863748 1.306867 -1.983783
Cl -2.133141 -2.960366 2.333468
P  -2.379441 0.654504 0.086024
O  -1.713611 -0.239852 1.276756
O  -3.811572 0.930332 0.708241
O  -1.676439 2.060909 0.298789
O  -2.293977 0.046252 -1.246643
C  0.444304 -0.596298 0.257866
C  -0.71262 -1.125273 1.004706
C  0.956595 -1.175514 -0.902618
C  1.018967 0.590319 0.707303
C  2.064177 1.190907 0.033069
C  2.015101 -0.588186 -1.57727
C  2.568387 0.594114 -1.117795
C  -0.775652 -2.363692 1.476681
C  -4.77791 -0.118743 0.747415
C  -1.262731 2.867546 -0.801819
H  0.637246 1.059296 1.603574
H  2.399771 -1.043111 -2.4787
H  0.034719 -3.06425 1.344878
H  -4.445136 -0.937102 1.38727
H  -4.985292 -0.50338 -0.25151
H  -5.686696 0.309681 1.162054
H  -0.452343 3.498253 -0.443502
H  -2.084909 3.498738 -1.140321
H  -0.906169 2.264583 -1.636068
totalener: -2869.74131521 hartree
nucrepener: 2295.95397621 hartree
electener: -5165.69529142 hartree
oneelecener: -8525.35624823 hartree
twoeener: 3359.66095681 hartree
kineticenergy: 2863.54560292 hartree
xcener: -165.290294897649 hartree
chargesum: -0.0000000
charge: -0.033465 -0.041620 -0.034978 -0.065392 0.891918 -0.336209 -0.320924 -0.325992 -0.501575 0.036892 0.173192 0.003278 -0.127754 0.041852 -0.115197 0.027766 -0.081262 -0.129002 -0.128806 0.125940 0.112947 0.121116 0.109278 0.119425 0.116068 0.111888 0.128092 0.122526
qa: -0.0335 -0.0416 -0.0350 -0.0654 0.8919 -0.3362 -0.3209 -0.3260 -0.5016 0.0369 0.1732 0.0033 -0.1278 0.0419 -0.1152 0.0278 -0.0813 -0.1290 -0.1288 0.1259 0.1129 0.1211 0.1093 0.1194 0.1161 0.1119 0.1281 0.1225
va: 1.2843 1.2754 1.2830 1.2506 5.6258 2.1181 2.1449 2.0965 2.0906 3.6678 3.8079 4.0311 3.8966 3.9506 4.0374 4.0059 4.0765 3.8687 3.8570 1.0323 1.0271 1.0203 1.0005 0.9912 0.9917 0.9913 0.9933 0.9943
dispcorr: -0.017871233 hartree
energy: -2869.759186441341
dipole: -18.55753 18.40428 -0.15325 6.33972 -6.05882 0.28089 0.34561 -0.23617 0.10944
magnitude: 0.33818 au
magnitude: 0.85958 debye
