program: Orca
programVersion: 5.0.2
elementType: Cl Cl Cl Cl P O O O O C C C C C C C C C C H H H H H H H H H
charge: 0
multiplicity: 1
keywords: wb97x-d3
keywords: def2-TZVPP
keywords: def2/J RIJCOSX
keywords: DEFGRID2
keywords: scfconv7
keywords: smallprint printgap noloewdin
keywords: NOSOSCF
formula: C10H9Cl4O4P
InChI: InChI=1/C10H9Cl4O4P/c1-16-19(15,17-2)18-10(5-11)6-3-8(13)9(14)4-7(6)12/h3-5H,1-2H3
28 atoms
Cl 0.362691 -2.267808 -1.950459
Cl 3.013129 2.371423 1.211023
Cl 4.263314 1.322802 -1.486555
Cl -2.243123 -3.115689 1.741798
P  -2.452165 0.591606 0.11218
O  -1.626089 -0.273764 1.212608
O  -3.781703 0.918083 0.91884
O  -1.689957 1.984797 0.175132
O  -2.578283 -0.054385 -1.198082
C  0.533226 -0.58435 0.18807
C  -0.676394 -1.164382 0.799144
C  1.08368 -1.014135 -1.019484
C  1.149393 0.477663 0.846437
C  2.291292 1.075247 0.350261
C  2.231477 -0.422632 -1.523811
C  2.841158 0.615676 -0.84276
C  -0.828032 -2.460909 1.035815
C  -4.782452 -0.090192 1.057214
C  -1.801638 2.904056 -0.908058
H  0.730536 0.840795 1.774823
H  2.648975 -0.765469 -2.459504
H  -0.058501 -3.178026 0.793702
H  -5.623792 0.370894 1.56781
H  -4.417574 -0.92615 1.654931
H  -5.109787 -0.461079 0.085682
H  -1.595493 2.422187 -1.863587
H  -1.065673 3.684315 -0.732427
H  -2.794638 3.354947 -0.939553
totalener: -2869.74200704 hartree
nucrepener: 2274.19540076 hartree
electener: -5143.93740780 hartree
oneelecener: -8482.02147935 hartree
twoeener: 3338.08407155 hartree
kineticenergy: 2863.54974257 hartree
xcener: -165.288380220853 hartree
chargesum: -0.0000000
charge: -0.031963 -0.039252 -0.035920 -0.064206 0.886750 -0.346939 -0.323886 -0.327807 -0.498009 0.056025 0.181198 -0.033440 -0.102306 0.045510 -0.117556 0.027586 -0.071147 -0.127647 -0.127932 0.116259 0.113876 0.119730 0.116626 0.109339 0.120221 0.122625 0.116371 0.115894
qa: -0.0320 -0.0393 -0.0359 -0.0642 0.8867 -0.3469 -0.3239 -0.3278 -0.4980 0.0560 0.1812 -0.0334 -0.1023 0.0455 -0.1176 0.0276 -0.0711 -0.1276 -0.1279 0.1163 0.1139 0.1197 0.1166 0.1093 0.1202 0.1226 0.1164 0.1159
va: 1.2850 1.2790 1.2814 1.2548 5.6456 2.1098 2.1315 2.1043 2.1037 3.6580 3.7650 4.0558 3.9339 3.9788 4.0296 4.0041 4.0929 3.8635 3.8665 1.0351 1.0271 1.0215 0.9917 1.0005 0.9917 0.9943 0.9898 0.9903
dispcorr: -0.016663872 hartree
energy: -2869.758670916794
dipole: -21.21385 20.92067 -0.29319 6.80709 -6.42587 0.38122 0.43247 -0.26653 0.16594
magnitude: 0.50875 au
magnitude: 1.29313 debye
