program: Orca
programVersion: 5.0.2
elementType: Cl Cl Cl Cl P O O O O C C C C C C C C C C H H H H H H H H H
charge: 0
multiplicity: 1
keywords: wb97x-d3
keywords: def2-TZVPP
keywords: def2/J RIJCOSX
keywords: DEFGRID2
keywords: scfconv7
keywords: smallprint printgap noloewdin
keywords: NOSOSCF
formula: C10H9Cl4O4P
InChI: InChI=1/C10H9Cl4O4P/c1-16-19(15,17-2)18-10(5-11)6-3-8(13)9(14)4-7(6)12/h3-5H,1-2H3
28 atoms
Cl 0.243529 -1.2561 -2.561171
Cl 3.359533 1.360255 2.126545
Cl 4.688197 -0.869666 0.34639
Cl -2.918273 2.062198 -2.09819
P  -1.838415 -0.380662 1.32824
O  -1.74927 0.924174 0.355853
O  -3.318454 -0.230882 1.869086
O  -1.850657 -1.546069 0.234135
O  -0.832555 -0.490529 2.385357
C  0.480412 0.510419 -0.499692
C  -0.903037 0.981816 -0.710051
C  1.084667 -0.480006 -1.272075
C  1.208633 1.051962 0.556318
C  2.501813 0.6489 0.826144
C  2.37933 -0.897173 -1.008347
C  3.090261 -0.334907 0.037125
C  -1.312907 1.518814 -1.851843
C  -4.45733 -0.128043 1.020017
C  -1.154055 -2.768792 0.466753
H  0.754326 1.80619 1.183382
H  2.834843 -1.667709 -1.613487
H  -0.645039 1.645053 -2.690443
H  -5.322379 -0.041928 1.672067
H  -4.569515 -1.015539 0.396605
H  -4.401418 0.753071 0.381393
H  -0.119356 -2.589674 0.758113
H  -1.173649 -3.319241 -0.470111
H  -1.641448 -3.360885 1.241914
totalener: -2869.73967269 hartree
nucrepener: 2301.16506970 hartree
electener: -5170.90474239 hartree
oneelecener: -8535.64439156 hartree
twoeener: 3364.73964917 hartree
kineticenergy: 2863.53817484 hartree
xcener: -165.290096009807 hartree
chargesum: -0.0000000
charge: -0.048265 -0.030810 -0.034560 -0.066230 0.871134 -0.330925 -0.314248 -0.327948 -0.492352 0.053132 0.176788 -0.077478 -0.076204 0.057012 -0.104636 0.023882 -0.082893 -0.123050 -0.136563 0.115869 0.115763 0.122958 0.119530 0.109988 0.111108 0.120128 0.119718 0.129150
qa: -0.0483 -0.0308 -0.0346 -0.0662 0.8711 -0.3309 -0.3142 -0.3279 -0.4924 0.0531 0.1768 -0.0775 -0.0762 0.0570 -0.1046 0.0239 -0.0829 -0.1231 -0.1366 0.1159 0.1158 0.1230 0.1195 0.1100 0.1111 0.1201 0.1197 0.1292
va: 1.2674 1.2885 1.2832 1.2501 5.6203 2.1101 2.1493 2.0350 2.1317 3.6471 3.7897 3.9814 3.9442 4.0056 4.0089 4.0193 4.0701 3.8652 3.8649 1.0317 1.0264 1.0183 0.9916 0.9916 1.0005 0.9900 0.9905 0.9963
dispcorr: -0.018207275 hartree
energy: -2869.757879963415
dipole: -19.26905 18.65233 -0.61672 -8.76637 8.12276 -0.64361 2.54780 -3.58543 -1.03763
magnitude: 1.36794 au
magnitude: 3.47702 debye
