program: Orca
programVersion: 5.0.2
elementType: Cl Cl Cl Cl P O O O O C C C C C C C C C C H H H H H H H H H
charge: 0
multiplicity: 1
keywords: wb97x-d3
keywords: def2-TZVPP
keywords: def2/J RIJCOSX
keywords: DEFGRID2
keywords: scfconv7
keywords: smallprint printgap noloewdin
keywords: NOSOSCF
formula: C10H9Cl4O4P
InChI: InChI=1/C10H9Cl4O4P/c1-16-19(15,17-2)18-10(5-11)6-3-8(13)9(14)4-7(6)12/h3-5H,1-2H3
28 atoms
Cl 0.377812 -0.504258 2.815817
Cl 3.115983 0.285175 -2.699731
Cl 4.488225 -1.42785 -0.438783
Cl -2.534385 2.865865 1.705955
P  -2.052049 -0.474524 -1.06117
O  -1.757389 1.001149 -0.433766
O  -1.841775 -1.385187 0.235366
O  -3.612558 -0.384532 -1.304788
O  -1.286286 -0.837513 -2.25401
C  0.512245 0.566014 0.310499
C  -0.791832 1.233266 0.497528
C  1.126387 -0.214947 1.289724
C  1.151213 0.691829 -0.92067
C  2.370155 0.089498 -1.170267
C  2.348941 -0.821004 1.052323
C  2.976299 -0.667629 -0.172025
C  -1.020993 2.094839 1.480758
C  -1.163206 -2.636704 0.15642
C  -4.544069 -0.057554 -0.277045
H  0.686857 1.272426 -1.705375
H  2.813581 -1.423248 1.819781
H  -0.25494 2.358873 2.193907
H  -0.918377 -2.921456 1.176478
H  -0.24652 -2.560116 -0.427561
H  -1.802075 -3.401468 -0.286485
H  -5.529455 -0.074108 -0.735205
H  -4.356394 0.935335 0.131162
H  -4.516058 -0.788958 0.531436
totalener: -2869.73964096 hartree
nucrepener: 2305.10609372 hartree
electener: -5174.84573469 hartree
oneelecener: -8543.37741767 hartree
twoeener: 3368.53168298 hartree
kineticenergy: 2863.52849985 hartree
xcener: -165.289830497513 hartree
chargesum: -0.0000000
charge: -0.046595 -0.028169 -0.033385 -0.065905 0.873945 -0.331099 -0.328558 -0.314071 -0.492431 0.018709 0.185207 -0.049110 -0.081227 0.053317 -0.106093 0.020650 -0.082727 -0.128873 -0.125673 0.119120 0.115355 0.122576 0.111903 0.120960 0.130263 0.119533 0.111784 0.110595
qa: -0.0466 -0.0282 -0.0334 -0.0659 0.8739 -0.3311 -0.3286 -0.3141 -0.4924 0.0187 0.1852 -0.0491 -0.0812 0.0533 -0.1061 0.0206 -0.0827 -0.1289 -0.1257 0.1191 0.1154 0.1226 0.1119 0.1210 0.1303 0.1195 0.1118 0.1106
va: 1.2706 1.2907 1.2836 1.2510 5.6120 2.1134 2.0334 2.1511 2.1348 3.6428 3.7874 3.9721 3.9392 4.0074 4.0119 4.0110 4.0647 3.8645 3.8630 1.0336 1.0271 1.0188 0.9911 0.9913 0.9963 0.9918 1.0030 0.9919
dispcorr: -0.018449066 hartree
energy: -2869.758090028516
dipole: -18.94605 18.57329 -0.37276 -7.42728 7.02794 -0.39934 1.65440 -0.34004 1.31435
magnitude: 1.42336 au
magnitude: 3.61789 debye
