program: Orca
programVersion: 5.0.2
elementType: Cl Cl Cl Cl P O O O O C C C C C C C C C C H H H H H H H H H
charge: 0
multiplicity: 1
keywords: wb97x-d3
keywords: def2-TZVPP
keywords: def2/J RIJCOSX
keywords: DEFGRID2
keywords: scfconv7
keywords: smallprint printgap noloewdin
keywords: NOSOSCF
formula: C10H9Cl4O4P
InChI: InChI=1/C10H9Cl4O4P/c1-16-19(15,17-2)18-10(5-11)6-3-8(13)9(14)4-7(6)12/h3-5H,1-2H3
28 atoms
Cl -0.329139 -0.445619 -2.81128
Cl 3.587798 0.19336 1.962553
Cl 4.385816 -1.497926 -0.571418
Cl -2.79325 3.016728 -1.02703
P  -1.887633 -0.483078 1.432069
O  -1.679817 1.010239 0.814467
O  -3.366268 -0.36013 1.983183
O  -1.962516 -1.347781 0.089865
O  -0.913492 -0.921181 2.431692
C  0.384154 0.569303 -0.385297
C  -0.910169 1.271008 -0.276137
C  0.747566 -0.203088 -1.487672
C  1.279869 0.658241 0.676994
C  2.51348 0.035561 0.638037
C  1.980418 -0.832225 -1.538375
C  2.866396 -0.712019 -0.481745
C  -1.297296 2.191131 -1.150482
C  -4.466774 0.042772 1.172542
C  -1.32343 -2.620717 0.009636
H  1.011083 1.230608 1.553895
H  2.252042 -1.425766 -2.399429
H  -0.677575 2.47388 -1.988022
H  -5.349105 0.003991 1.80605
H  -4.607277 -0.632055 0.327279
H  -4.337643 1.059402 0.801431
H  -1.836206 -3.359641 0.626163
H  -0.280517 -2.564248 0.320449
H  -1.373637 -2.925523 -1.032392
totalener: -2869.73951036 hartree
nucrepener: 2304.04341749 hartree
electener: -5173.78292785 hartree
oneelecener: -8541.24996133 hartree
twoeener: 3367.46703348 hartree
kineticenergy: 2863.53679686 hartree
xcener: -165.290796625395 hartree
chargesum: 0.0000000
charge: -0.045970 -0.028445 -0.033417 -0.066238 0.872635 -0.329698 -0.313969 -0.329955 -0.491858 0.018694 0.184997 -0.052189 -0.077210 0.052766 -0.104815 0.020675 -0.083369 -0.126128 -0.131484 0.118060 0.115478 0.123200 0.119531 0.111264 0.111317 0.131322 0.119103 0.115700
qa: -0.0460 -0.0284 -0.0334 -0.0662 0.8726 -0.3297 -0.3140 -0.3300 -0.4919 0.0187 0.1850 -0.0522 -0.0772 0.0528 -0.1048 0.0207 -0.0834 -0.1261 -0.1315 0.1181 0.1155 0.1232 0.1195 0.1113 0.1113 0.1313 0.1191 0.1157
va: 1.2708 1.2903 1.2837 1.2505 5.6141 2.1135 2.1496 2.0312 2.1359 3.6499 3.7899 3.9699 3.9474 4.0086 4.0131 4.0109 4.0651 3.8640 3.8643 1.0324 1.0273 1.0178 0.9918 0.9916 1.0027 0.9969 0.9900 0.9913
dispcorr: -0.018432849 hartree
energy: -2869.757943210922
dipole: -19.15683 18.52598 -0.63085 -7.06833 6.74381 -0.32452 2.04425 -3.26734 -1.22309
magnitude: 1.41394 au
magnitude: 3.59395 debye
