program: Orca
programVersion: 5.0.2
elementType: Cl Cl Cl Cl P O O O O C C C C C C C C C C H H H H H H H H H
charge: 0
multiplicity: 1
keywords: wb97x-d3
keywords: def2-TZVPP
keywords: def2/J RIJCOSX
keywords: DEFGRID2
keywords: scfconv7
keywords: smallprint printgap noloewdin
keywords: NOSOSCF
formula: C10H9Cl4O4P
InChI: InChI=1/C10H9Cl4O4P/c1-16-19(15,17-2)18-10(5-11)6-3-8(13)9(14)4-7(6)12/h3-5H,1-2H3
28 atoms
Cl 0.417271 -0.638089 -2.877461
Cl 2.912977 0.384854 2.714083
Cl 4.350055 -1.475017 0.611317
Cl -2.627323 2.700039 -1.971733
P  -2.192379 -0.601125 0.667971
O  -1.830529 0.935272 0.250815
O  -1.368336 -0.802302 2.009389
O  -3.65409 -0.395568 1.244766
O  -1.981288 -1.570628 -0.412802
C  0.451267 0.54061 -0.425118
C  -0.858942 1.173256 -0.675448
C  1.093211 -0.297825 -1.335777
C  1.045719 0.736519 0.819353
C  2.239763 0.128816 1.1559
C  2.296643 -0.904033 -1.010647
C  2.870943 -0.697671 0.231248
C  -1.093743 1.990219 -1.69312
C  -0.567999 -1.959971 2.23719
C  -4.731988 -0.141138 0.344905
H  0.560424 1.375646 1.544388
H  2.782847 -1.555962 -1.722059
H  -0.322648 2.251589 -2.401862
H  -1.16645 -2.749613 2.691823
H  0.220347 -1.667383 2.926967
H  -0.119398 -2.335527 1.318052
H  -5.632464 -0.070499 0.949085
H  -4.844748 -0.952328 -0.374745
H  -4.586814 0.797733 -0.19072
totalener: -2869.74069201 hartree
nucrepener: 2302.97491068 hartree
electener: -5172.71560269 hartree
oneelecener: -8539.35748264 hartree
twoeener: 3366.64187995 hartree
kineticenergy: 2863.55170347 hartree
xcener: -165.291382307671 hartree
chargesum: 0.0000000
charge: -0.028137 -0.039178 -0.033632 -0.065300 0.891495 -0.335750 -0.325740 -0.320835 -0.500456 0.016430 0.173678 0.008642 -0.107350 0.027468 -0.125622 0.035299 -0.082594 -0.129689 -0.128008 0.124886 0.114901 0.121865 0.129831 0.113610 0.119408 0.116503 0.119355 0.108918
qa: -0.0281 -0.0392 -0.0336 -0.0653 0.8915 -0.3358 -0.3257 -0.3208 -0.5005 0.0164 0.1737 0.0086 -0.1074 0.0275 -0.1256 0.0353 -0.0826 -0.1297 -0.1280 0.1249 0.1149 0.1219 0.1298 0.1136 0.1194 0.1165 0.1194 0.1089
va: 1.2889 1.2772 1.2844 1.2502 5.6269 2.1153 2.0963 2.1490 2.0918 3.6797 3.8048 4.0300 3.8865 3.9479 4.0457 3.9938 4.0865 3.8664 3.8688 1.0324 1.0275 1.0189 0.9944 0.9889 0.9920 0.9916 0.9909 0.9999
dispcorr: -0.018316277 hartree
energy: -2869.759008288685
dipole: -17.18904 17.12622 -0.06282 -5.32629 5.32363 -0.00266 5.83977 -5.54525 0.29452
magnitude: 0.30116 au
magnitude: 0.76548 debye
