program: Orca
programVersion: 5.0.2
elementType: Cl Cl Cl Cl P O O O O C C C C C C C C C C H H H H H H H H H
charge: 0
multiplicity: 1
keywords: wb97x-d3
keywords: def2-TZVPP
keywords: def2/J RIJCOSX
keywords: DEFGRID2
keywords: scfconv7
keywords: smallprint printgap noloewdin
keywords: NOSOSCF
formula: C10H9Cl4O4P
InChI: InChI=1/C10H9Cl4O4P/c1-16-19(15,17-2)18-10(5-11)6-3-8(13)9(14)4-7(6)12/h3-5H,1-2H3
28 atoms
Cl -0.234808 -0.022016 -2.939167
Cl 3.572039 -0.162265 1.964869
Cl 4.406814 -1.483119 -0.772573
Cl -2.721089 3.147643 -0.686354
P  -1.923293 -0.715032 1.127753
O  -1.662082 0.861407 0.832598
O  -3.375202 -0.650964 1.76847
O  -2.191986 -1.250729 -0.3408
O  -0.888391 -1.394797 1.916561
C  0.429804 0.603983 -0.371871
C  -0.861699 1.294133 -0.182366
C  0.809039 -0.004024 -1.567349
C  1.304512 0.52553 0.708402
C  2.528333 -0.106646 0.606241
C  2.033878 -0.641296 -1.682865
C  2.896645 -0.690752 -0.602252
C  -1.224738 2.347173 -0.903022
C  -3.535103 -0.363637 3.155073
C  -1.876543 -2.591753 -0.70562
H  1.022933 0.970051 1.65265
H  2.316482 -1.108241 -2.615255
H  -0.58101 2.754671 -1.668019
H  -2.877026 -0.976636 3.770884
H  -4.569106 -0.584893 3.405673
H  -3.341575 0.690238 3.359873
H  -1.889293 -2.628035 -1.791443
H  -2.621932 -3.285407 -0.315253
H  -0.89065 -2.884193 -0.345205
totalener: -2869.73974874 hartree
nucrepener: 2287.96294024 hartree
electener: -5157.70268898 hartree
oneelecener: -8509.57736117 hartree
twoeener: 3351.87467220 hartree
kineticenergy: 2863.54467498 hartree
xcener: -165.290240767775 hartree
chargesum: 0.0000000
charge: -0.047134 -0.035011 -0.036246 -0.058787 0.887567 -0.319835 -0.325484 -0.316045 -0.508411 0.063598 0.165359 -0.055237 -0.088704 0.063207 -0.115798 0.022264 -0.093445 -0.131363 -0.136785 0.110348 0.114696 0.124378 0.118304 0.116787 0.115809 0.115737 0.126171 0.124063
qa: -0.0471 -0.0350 -0.0362 -0.0588 0.8876 -0.3198 -0.3255 -0.3160 -0.5084 0.0636 0.1654 -0.0552 -0.0887 0.0632 -0.1158 0.0223 -0.0934 -0.1314 -0.1368 0.1103 0.1147 0.1244 0.1183 0.1168 0.1158 0.1157 0.1262 0.1241
va: 1.2680 1.2835 1.2807 1.2547 5.6306 2.1345 2.1375 2.0961 2.0893 3.6556 3.7960 3.9885 3.9566 3.9973 4.0292 4.0161 4.0849 3.8682 3.8583 1.0346 1.0272 1.0159 0.9944 0.9898 0.9879 0.9922 0.9936 0.9924
dispcorr: -0.017155324 hartree
energy: -2869.756904064435
dipole: -17.77592 17.31226 -0.46366 -7.93144 7.65932 -0.27212 7.42191 -7.62000 -0.19809
magnitude: 0.57295 au
magnitude: 1.45633 debye
