program: Orca
programVersion: 5.0.2
elementType: S S S P O O C C C C C C C C C H H H H H H H H H H H H H H H H H H H H H
charge: 0
multiplicity: 1
keywords: wb97x-d3
keywords: def2-TZVPP
keywords: def2/J RIJCOSX
keywords: DEFGRID2
keywords: scfconv7
keywords: smallprint printgap noloewdin
keywords: NOSOSCF
formula: C9H21O2PS3
InChI: InChI=1/C9H21O2PS3/c1-6-10-12(13,11-7-2)15-8-14-9(3,4)5/h6-8H2,1-5H3
36 atoms
S  2.084562 -0.316078 -0.968088
S  0.016795 -0.780699 1.284257
S  -1.471151 -0.159382 -1.732116
P  -1.575826 0.00625 0.18638
O  -2.785828 -0.741357 0.918984
O  -1.787343 1.495366 0.747534
C  3.638852 -0.186378 0.016841
C  4.404005 0.947831 -0.658404
C  3.3538 0.170385 1.468108
C  4.431748 -1.482485 -0.075197
C  1.081672 -1.473533 -0.035173
C  -4.146882 -0.510584 0.481056
C  -1.238772 2.667895 0.118325
C  -4.687873 -1.746222 -0.190512
C  0.224151 2.86304 0.431706
H  5.369377 1.079288 -0.165849
H  4.598314 0.738586 -1.711887
H  3.864515 1.893687 -0.590944
H  4.297943 0.355517 1.986337
H  2.850998 -0.637451 2.001187
H  2.741521 1.068438 1.552252
H  3.88845 -2.327379 0.351082
H  4.679135 -1.725637 -1.108662
H  5.367102 -1.386208 0.481728
H  0.452652 -2.015694 -0.738025
H  1.702442 -2.211821 0.473621
H  -4.715111 -0.262689 1.3768
H  -4.20131 0.348499 -0.19095
H  -1.40501 2.612234 -0.95942
H  -1.833515 3.494243 0.504641
H  -4.649756 -2.610953 0.472001
H  -5.730308 -1.580168 -0.463356
H  -4.134597 -1.977732 -1.100588
H  0.543689 3.822505 0.023516
H  0.40586 2.879664 1.506443
H  0.845493 2.086516 -0.016069
elementType: S P O C H
totalener: -2042.18514315 hartree
nucrepener: 1713.29674847 hartree
electener: -3755.48189161 hartree
oneelecener: -6222.37480677 hartree
twoeener: 2466.89291516 hartree
cpcmener: -0.01962540 hartree
kineticenergy: 2036.97292486 hartree
xcener: -124.860279456228 hartree
chargesum: -0.0000000
charge: -0.180030 -0.158488 -0.456504 0.664668 -0.361844 -0.358770 0.211956 -0.302335 -0.331161 -0.315844 -0.131677 0.042871 0.044357 -0.235557 -0.228172 0.100354 0.104614 0.106753 0.108637 0.087083 0.103699 0.100881 0.094888 0.099150 0.151521 0.157444 0.106235 0.086198 0.090015 0.108458 0.089372 0.094088 0.073371 0.099628 0.089487 0.044655
qa: -0.1800 -0.1585 -0.4565 0.6647 -0.3618 -0.3588 0.2120 -0.3023 -0.3312 -0.3158 -0.1317 0.0429 0.0444 -0.2356 -0.2282 0.1004 0.1046 0.1068 0.1086 0.0871 0.1037 0.1009 0.0949 0.0992 0.1515 0.1574 0.1062 0.0862 0.0900 0.1085 0.0894 0.0941 0.0734 0.0996 0.0895 0.0447
va: 2.2401 2.2900 1.9900 5.3913 2.0986 2.0793 3.8228 3.8887 3.9416 3.9379 3.9778 3.8694 3.8563 3.9385 3.8833 1.0040 1.0083 1.0039 1.0066 0.9990 1.0025 1.0039 1.0140 1.0030 1.0263 1.0062 0.9955 1.0057 1.0148 0.9920 1.0040 1.0077 1.0178 1.0155 1.0070 1.0464
dispcorr: -0.017980646 hartree
energy: -2042.203123790912
dipole: 15.46053 -14.90708 0.55344 4.06668 -3.64648 0.42020 2.74073 -1.82822 0.91252
magnitude: 1.14697 au
magnitude: 2.91538 debye
