program: Orca
programVersion: 5.0.2
elementType: S S S P O O C C C C C C C C C H H H H H H H H H H H H H H H H H H H H H
charge: 0
multiplicity: 1
keywords: wb97x-d3
keywords: def2-TZVPP
keywords: def2/J RIJCOSX
keywords: DEFGRID2
keywords: scfconv7
keywords: smallprint printgap noloewdin
keywords: NOSOSCF
formula: C9H21O2PS3
InChI: InChI=1/C9H21O2PS3/c1-6-10-12(13,11-7-2)15-8-14-9(3,4)5/h6-8H2,1-5H3
36 atoms
S  2.094838 -0.183007 -0.913032
S  -0.11815 -0.648022 1.174114
S  -1.450594 0.309084 -1.808818
P  -1.679584 0.244895 0.103484
O  -3.000237 -0.450171 0.681948
O  -1.915832 1.645672 0.837337
C  3.601773 -0.333012 0.137476
C  4.241052 -1.702491 -0.0450
C  4.531439 0.753125 -0.392652
C  3.283348 -0.075792 1.602994
C  0.942094 -1.324421 -0.153499
C  -3.228156 -1.871311 0.677702
C  -1.363075 2.88366 0.348064
C  -3.739324 -2.377221 -0.648579
C  0.112983 3.019341 0.628187
H  5.147318 -1.771826 0.561364
H  3.581317 -2.511786 0.271783
H  4.517246 -1.878316 -1.084785
H  5.480063 0.713509 0.145895
H  4.109312 1.749061 -0.25231
H  4.75052 0.62002 -1.45352
H  4.213267 -0.060436 2.176711
H  2.780946 0.881502 1.745839
H  2.657456 -0.858635 2.033594
H  0.302531 -1.729706 -0.93494
H  1.462278 -2.168231 0.299841
H  -2.31428 -2.392582 0.972229
H  -3.966118 -2.034367 1.461327
H  -1.56789 2.974227 -0.720491
H  -1.930082 3.658263 0.861894
H  -4.025132 -3.423229 -0.534783
H  -4.620539 -1.824897 -0.974551
H  -2.982839 -2.319757 -1.429331
H  0.433636 4.016694 0.325064
H  0.335373 2.90491 1.689059
H  0.706123 2.295202 0.068333
elementType: S P O C H
totalener: -2042.18408772 hartree
nucrepener: 1717.97436902 hartree
electener: -3760.15845674 hartree
oneelecener: -6231.51096985 hartree
twoeener: 2471.35251311 hartree
cpcmener: -0.02101552 hartree
kineticenergy: 2036.99269471 hartree
xcener: -124.866994502426 hartree
chargesum: 0.0000000
charge: -0.176884 -0.170821 -0.449682 0.656381 -0.354136 -0.360790 0.215809 -0.324514 -0.298566 -0.332722 -0.122348 0.040868 0.039719 -0.246529 -0.234039 0.100051 0.102403 0.095191 0.099677 0.105966 0.103589 0.107837 0.102664 0.087793 0.147503 0.157062 0.088883 0.109612 0.092608 0.109611 0.098299 0.088564 0.077848 0.100975 0.088221 0.053898
qa: -0.1769 -0.1708 -0.4497 0.6564 -0.3541 -0.3608 0.2158 -0.3245 -0.2986 -0.3327 -0.1223 0.0409 0.0397 -0.2465 -0.2340 0.1001 0.1024 0.0952 0.0997 0.1060 0.1036 0.1078 0.1027 0.0878 0.1475 0.1571 0.0889 0.1096 0.0926 0.1096 0.0983 0.0886 0.0778 0.1010 0.0882 0.0539
va: 2.2517 2.2913 1.9972 5.4142 2.1082 2.0993 3.8277 3.9409 3.8805 3.9380 3.9757 3.8522 3.8573 3.9013 3.8764 1.0029 1.0035 1.0139 1.0041 1.0069 1.0092 1.0068 1.0055 0.9988 1.0262 1.0060 1.0129 0.9904 1.0143 0.9917 1.0093 1.0062 1.0183 1.0138 1.0076 1.0401
dispcorr: -0.017929124 hartree
energy: -2042.202016843682
dipole: 18.90821 -17.76029 1.14792 -2.78982 1.85593 -0.93389 4.29196 -3.06404 1.22792
magnitude: 1.92293 au
magnitude: 4.88770 debye
