program: Orca
programVersion: 5.0.2
elementType: S S S P O O C C C C C C C C C H H H H H H H H H H H H H H H H H H H H H
charge: 0
multiplicity: 1
keywords: wb97x-d3
keywords: def2-TZVPP
keywords: def2/J RIJCOSX
keywords: DEFGRID2
keywords: scfconv7
keywords: smallprint printgap noloewdin
keywords: NOSOSCF
formula: C9H21O2PS3
InChI: InChI=1/C9H21O2PS3/c1-6-10-12(13,11-7-2)15-8-14-9(3,4)5/h6-8H2,1-5H3
36 atoms
S  2.992687 0.264223 0.67857
S  0.022181 0.513552 0.977946
S  -1.026007 -0.264118 -2.16955
P  -1.496932 0.48751 -0.457838
O  -2.674252 -0.228328 0.358226
O  -2.04792 1.976903 -0.615065
C  3.159208 -1.392653 -0.119667
C  3.436511 -1.236559 -1.607904
C  4.367013 -2.011656 0.577271
C  1.924688 -2.251865 0.108006
C  1.492478 0.945448 -0.032888
C  -2.880033 -1.656769 0.37427
C  -2.475493 2.794835 0.498325
C  -2.07408 -2.34161 1.450079
C  -3.979352 2.889913 0.549983
H  4.333733 -0.644405 -1.789038
H  3.584774 -2.220974 -2.058298
H  2.605008 -0.766507 -2.135312
H  4.564894 -2.995926 0.148386
H  4.194924 -2.143323 1.646384
H  5.267431 -1.409016 0.44599
H  1.693288 -2.353976 1.16821
H  1.045004 -1.852178 -0.397576
H  2.10526 -3.251279 -0.295802
H  1.596462 2.028499 -0.052364
H  1.340724 0.600262 -1.056135
H  -3.947285 -1.782238 0.548992
H  -2.651372 -2.0667 -0.611517
H  -2.072978 2.410177 1.437837
H  -2.029029 3.774417 0.331543
H  -2.258949 -1.902184 2.430898
H  -2.371964 -3.389815 1.493059
H  -1.003291 -2.30897 1.24854
H  -4.388555 3.282612 -0.380703
H  -4.443887 1.926733 0.757738
H  -4.260495 3.574815 1.350532
elementType: S P O C H
totalener: -2042.18645628 hartree
nucrepener: 1702.91064827 hartree
electener: -3745.09710455 hartree
oneelecener: -6200.96431291 hartree
twoeener: 2455.86720835 hartree
cpcmener: -0.01892259 hartree
kineticenergy: 2036.95260536 hartree
xcener: -124.856882174002 hartree
chargesum: 0.0000000
charge: -0.174298 -0.175199 -0.451863 0.656381 -0.345204 -0.361389 0.195394 -0.321921 -0.289459 -0.305154 -0.101611 0.037850 0.049237 -0.235338 -0.250459 0.097752 0.101753 0.098858 0.099541 0.104581 0.104264 0.098796 0.053076 0.107566 0.164207 0.114412 0.106546 0.089473 0.093312 0.108676 0.094635 0.100899 0.067480 0.088277 0.083701 0.095227
qa: -0.1743 -0.1752 -0.4519 0.6564 -0.3452 -0.3614 0.1954 -0.3219 -0.2895 -0.3052 -0.1016 0.0378 0.0492 -0.2353 -0.2505 0.0978 0.1018 0.0989 0.0995 0.1046 0.1043 0.0988 0.0531 0.1076 0.1642 0.1144 0.1065 0.0895 0.0933 0.1087 0.0946 0.1009 0.0675 0.0883 0.0837 0.0952
va: 2.2316 2.2829 1.9970 5.4237 2.0911 2.1061 3.8756 3.9461 3.8605 3.9078 3.9594 3.8561 3.8417 3.9082 3.9420 1.0143 1.0027 1.0005 1.0036 1.0115 1.0103 1.0107 1.0345 1.0093 1.0004 1.0522 0.9905 1.0147 1.0069 0.9926 1.0045 1.0124 1.0030 1.0038 1.0124 1.0068
dispcorr: -0.018231757 hartree
energy: -2042.204688038787
dipole: 5.20476 -5.61235 -0.40759 -10.99512 10.64652 -0.34860 4.96743 -3.78928 1.17815
magnitude: 1.29448 au
magnitude: 3.29031 debye
