program: Orca
programVersion: 5.0.2
elementType: S S S P O O C C C C C C C C C H H H H H H H H H H H H H H H H H H H H H
charge: 0
multiplicity: 1
keywords: wb97x-d3
keywords: def2-TZVPP
keywords: def2/J RIJCOSX
keywords: DEFGRID2
keywords: scfconv7
keywords: smallprint printgap noloewdin
keywords: NOSOSCF
formula: C9H21O2PS3
InChI: InChI=1/C9H21O2PS3/c1-6-10-12(13,11-7-2)15-8-14-9(3,4)5/h6-8H2,1-5H3
36 atoms
S  2.318082 0.516866 -0.495043
S  -0.060934 -0.321387 -2.171509
S  -3.20041 0.273454 -1.443313
P  -1.485124 -0.13156 -0.66983
O  -1.33607 -1.495586 0.142954
O  -0.931716 0.92158 0.402948
C  2.9550 -0.242905 1.062602
C  1.815821 -0.64939 1.98695
C  3.84677 -1.435029 0.746905
C  3.771661 0.873211 1.705764
C  1.447573 -0.85277 -1.291561
C  -2.372784 -2.013576 1.006047
C  -0.840039 2.318342 0.067489
C  -2.469644 -1.264542 2.311325
C  -0.153631 3.035716 1.198614
H  1.176764 -1.41572 1.547738
H  2.228833 -1.068044 2.907809
H  1.193602 0.203086 2.25694
H  4.667605 -1.156293 0.085879
H  3.2919 -2.248068 0.276484
H  4.276575 -1.828956 1.671071
H  3.157687 1.749023 1.924287
H  4.189101 0.518644 2.650058
H  4.602637 1.1866 1.072312
H  2.060662 -1.301901 -2.07264
H  1.202992 -1.63992 -0.580923
H  -3.324142 -2.003243 0.470803
H  -2.093898 -3.05185 1.174063
H  -0.275123 2.433861 -0.860328
H  -1.845781 2.710793 -0.094915
H  -2.841938 -0.249036 2.178556
H  -3.170659 -1.787788 2.962126
H  -1.507252 -1.222723 2.821934
H  -0.696238 2.919486 2.136725
H  0.867033 2.678519 1.334492
H  -0.110503 4.100069 0.967834
elementType: S P O C H
totalener: -2042.18800798 hartree
nucrepener: 1744.02966331 hartree
electener: -3786.21767129 hartree
oneelecener: -6283.14128836 hartree
twoeener: 2496.92361707 hartree
cpcmener: -0.02051078 hartree
kineticenergy: 2036.97059498 hartree
xcener: -124.859154301174 hartree
chargesum: 0.0000000
charge: -0.184641 -0.147440 -0.455634 0.620257 -0.348155 -0.313578 0.210660 -0.347949 -0.315783 -0.304467 -0.135133 0.026952 0.003215 -0.239967 -0.233475 0.094571 0.110981 0.092251 0.096769 0.097909 0.100148 0.113040 0.100437 0.104783 0.163436 0.139935 0.097725 0.109649 0.100960 0.112541 0.078835 0.103568 0.090307 0.093291 0.063376 0.100626
qa: -0.1846 -0.1474 -0.4556 0.6203 -0.3482 -0.3136 0.2107 -0.3479 -0.3158 -0.3045 -0.1351 0.0270 0.0032 -0.2400 -0.2335 0.0946 0.1110 0.0923 0.0968 0.0979 0.1001 0.1130 0.1004 0.1048 0.1634 0.1399 0.0977 0.1096 0.1010 0.1125 0.0788 0.1036 0.0903 0.0933 0.0634 0.1006
va: 2.2002 2.3121 2.0225 5.4302 2.0849 2.0510 3.8507 3.9508 3.9238 3.8781 3.9912 3.8530 3.8401 3.9042 3.9347 1.0085 1.0083 1.0065 1.0142 1.0030 1.0041 0.9984 1.0037 1.0109 0.9968 1.0173 1.0117 0.9916 1.0008 1.0117 1.0174 1.0099 1.0018 1.0039 1.0190 1.0088
dispcorr: -0.020135392 hartree
energy: -2042.208143367549
dipole: 17.26712 -15.69048 1.57664 -0.25277 -0.52772 -0.78049 24.87374 -22.77364 2.10010
magnitude: 2.73959 au
magnitude: 6.96349 debye
