program: Orca
programVersion: 5.0.2
elementType: S S S P O O C C C C C C C C C H H H H H H H H H H H H H H H H H H H H H
charge: 0
multiplicity: 1
keywords: wb97x-d3
keywords: def2-TZVPP
keywords: def2/J RIJCOSX
keywords: DEFGRID2
keywords: scfconv7
keywords: smallprint printgap noloewdin
keywords: NOSOSCF
formula: C9H21O2PS3
InChI: InChI=1/C9H21O2PS3/c1-6-10-12(13,11-7-2)15-8-14-9(3,4)5/h6-8H2,1-5H3
36 atoms
S  2.440368 0.39212 -0.506963
S  0.0167 -0.310692 -2.171569
S  -3.067824 0.519943 -1.458927
P  -1.409708 -0.074403 -0.681094
O  -1.404356 -1.490997 0.054833
O  -0.776307 0.856965 0.455811
C  3.066064 -0.402037 1.037055
C  1.923538 -0.717977 1.992616
C  3.861173 -1.657097 0.705893
C  3.98002 0.654516 1.649715
C  1.483439 -0.93215 -1.27965
C  -2.461866 -1.901113 0.952728
C  -0.583585 2.270165 0.236041
C  -2.451347 -1.155722 2.265196
C  -1.63857 3.069734 0.957724
H  1.209521 -1.426182 1.570413
H  2.325224 -1.172867 2.901249
H  1.38164 0.18247 2.280614
H  4.682719 -1.440738 0.022503
H  3.238713 -2.430864 0.253735
H  4.285246 -2.077235 1.621066
H  3.439868 1.575546 1.8757
H  4.394122 0.276684 2.586569
H  4.815397 0.899855 0.992482
H  2.065484 -1.439578 -2.048812
H  1.181997 -1.685254 -0.553907
H  -3.422236 -1.793057 0.444897
H  -2.283882 -2.962767 1.111259
H  0.413851 2.492961 0.610647
H  -0.585058 2.494857 -0.833282
H  -2.749993 -0.1133 2.156562
H  -3.166862 -1.631095 2.936876
H  -1.471494 -1.193067 2.7423
H  -2.634279 2.866283 0.564882
H  -1.633908 2.862299 2.027938
H  -1.4343 4.132511 0.823657
elementType: S P O C H
totalener: -2042.18651395 hartree
nucrepener: 1738.02513573 hartree
electener: -3780.21164968 hartree
oneelecener: -6271.17493782 hartree
twoeener: 2490.96328814 hartree
cpcmener: -0.02049583 hartree
kineticenergy: 2036.96012129 hartree
xcener: -124.857153674882 hartree
chargesum: 0.0000000
charge: -0.184818 -0.145993 -0.455763 0.622471 -0.349663 -0.325945 0.208102 -0.341267 -0.316495 -0.298554 -0.133202 0.025076 0.056731 -0.237994 -0.249393 0.089176 0.110455 0.094060 0.097630 0.097918 0.100562 0.105492 0.099164 0.104289 0.161166 0.139919 0.097346 0.110382 0.089441 0.089403 0.077011 0.104526 0.089827 0.078247 0.090597 0.100095
qa: -0.1848 -0.1460 -0.4558 0.6225 -0.3497 -0.3259 0.2081 -0.3413 -0.3165 -0.2986 -0.1332 0.0251 0.0567 -0.2380 -0.2494 0.0892 0.1105 0.0941 0.0976 0.0979 0.1006 0.1055 0.0992 0.1043 0.1612 0.1399 0.0973 0.1104 0.0894 0.0894 0.0770 0.1045 0.0898 0.0782 0.0906 0.1001
va: 2.1990 2.3116 2.0144 5.4324 2.0806 2.0424 3.8595 3.9459 3.9240 3.8715 3.9914 3.8570 3.8240 3.9058 3.9565 1.0110 1.0080 1.0085 1.0136 1.0027 1.0042 1.0093 1.0039 1.0112 0.9982 1.0175 1.0105 0.9912 1.0072 1.0121 1.0120 1.0099 1.0018 1.0193 1.0021 1.0086
dispcorr: -0.019753959 hartree
energy: -2042.206267911333
dipole: 14.28137 -12.81284 1.46853 -1.18285 0.31598 -0.86687 24.56877 -22.38133 2.18744
magnitude: 2.77362 au
magnitude: 7.04997 debye
