program: Orca
programVersion: 5.0.2
elementType: S S S P O O C C C C C C C C C H H H H H H H H H H H H H H H H H H H H H
charge: 0
multiplicity: 1
keywords: wb97x-d3
keywords: def2-TZVPP
keywords: def2/J RIJCOSX
keywords: DEFGRID2
keywords: scfconv7
keywords: smallprint printgap noloewdin
keywords: NOSOSCF
formula: C9H21O2PS3
InChI: InChI=1/C9H21O2PS3/c1-6-10-12(13,11-7-2)15-8-14-9(3,4)5/h6-8H2,1-5H3
36 atoms
S  3.115394 -0.333125 -0.734492
S  0.20437 -0.423496 -1.361325
S  -3.099673 -0.04975 -1.506147
P  -1.497107 0.466361 -0.570258
O  -1.480089 0.167137 1.011394
O  -1.087223 2.012347 -0.60813
C  3.289879 -1.178472 0.897515
C  3.54719 -0.14789 1.98872
C  2.058446 -2.009002 1.221765
C  4.509937 -2.076534 0.725194
C  1.559017 0.548017 -0.577996
C  -2.301554 -0.850581 1.618416
C  -2.057424 3.073742 -0.465809
C  -1.873569 -2.255442 1.270619
C  -2.59582 3.205314 0.937814
H  2.708946 0.540756 2.107449
H  3.688907 -0.651237 2.948211
H  4.441981 0.439322 1.781796
H  1.840661 -2.735278 0.4392
H  1.174583 -1.387796 1.365627
H  2.224199 -2.553983 2.154113
H  5.403539 -1.504782 0.468327
H  4.711237 -2.594982 1.664563
H  4.352879 -2.832855 -0.045108
H  1.329207 0.757757 0.466085
H  1.64907 1.494437 -1.106449
H  -2.209315 -0.673894 2.68887
H  -3.343166 -0.682272 1.339607
H  -1.518484 3.972932 -0.758053
H  -2.86467 2.918003 -1.184122
H  -2.496433 -2.954961 1.828955
H  -2.004028 -2.475316 0.211011
H  -0.835893 -2.445026 1.542154
H  -3.194341 4.114852 0.994817
H  -3.24071 2.372307 1.216916
H  -1.792879 3.289681 1.6699
elementType: S P O C H
totalener: -2042.18670854 hartree
nucrepener: 1699.72890386 hartree
electener: -3741.91561241 hartree
oneelecener: -6194.39887746 hartree
twoeener: 2452.48326506 hartree
cpcmener: -0.02100930 hartree
kineticenergy: 2036.95351948 hartree
xcener: -124.855762492146 hartree
chargesum: -0.0000000
charge: -0.175981 -0.156015 -0.459719 0.649048 -0.361033 -0.352498 0.204354 -0.324383 -0.327362 -0.291684 -0.122221 0.051067 0.023808 -0.260844 -0.238572 0.104294 0.101505 0.097102 0.102691 0.067402 0.109096 0.106109 0.099497 0.103671 0.132681 0.156629 0.112488 0.098727 0.107814 0.090458 0.107311 0.074428 0.099693 0.100526 0.079077 0.090835
qa: -0.1760 -0.1560 -0.4597 0.6490 -0.3610 -0.3525 0.2044 -0.3244 -0.3274 -0.2917 -0.1222 0.0511 0.0238 -0.2608 -0.2386 0.1043 0.1015 0.0971 0.1027 0.0674 0.1091 0.1061 0.0995 0.1037 0.1327 0.1566 0.1125 0.0987 0.1078 0.0905 0.1073 0.0744 0.0997 0.1005 0.0791 0.0908
va: 2.2333 2.2968 1.9984 5.3852 2.0370 2.0931 3.8789 3.9477 3.9192 3.8668 4.0079 3.8001 3.8752 3.9244 3.8953 1.0003 1.0026 1.0129 1.0113 1.0142 1.0066 1.0090 1.0036 1.0122 1.0262 1.0081 0.9929 1.0147 0.9898 1.0099 1.0120 1.0212 0.9947 1.0089 1.0127 1.0063
dispcorr: -0.018407960 hartree
energy: -2042.205116502894
dipole: 10.47669 -9.93824 0.53845 -3.70096 4.30919 0.60823 21.92725 -19.31955 2.60770
magnitude: 2.73130 au
magnitude: 6.94241 debye
