program: Orca
programVersion: 5.0.2
elementType: S S S P O O C C C C C C C C C H H H H H H H H H H H H H H H H H H H H H
charge: 0
multiplicity: 1
keywords: wb97x-d3
keywords: def2-TZVPP
keywords: def2/J RIJCOSX
keywords: DEFGRID2
keywords: scfconv7
keywords: smallprint printgap noloewdin
keywords: NOSOSCF
formula: C9H21O2PS3
InChI: InChI=1/C9H21O2PS3/c1-6-10-12(13,11-7-2)15-8-14-9(3,4)5/h6-8H2,1-5H3
36 atoms
S  1.869719 -1.096121 -0.903922
S  0.66645 1.441959 0.390031
S  -1.306206 1.029744 -2.382894
P  -1.151924 0.89102 -0.469295
O  -1.509512 -0.596423 0.000857
O  -2.061455 1.862381 0.425581
C  3.142356 -1.570812 0.345145
C  2.868582 -0.929682 1.696869
C  3.009673 -3.087059 0.447538
C  4.529124 -1.19702 -0.158417
C  1.81668 0.695345 -0.82373
C  -1.543295 -0.976631 1.392322
C  -3.473678 1.988135 0.137727
C  -1.216653 -2.442224 1.496059
C  -4.145236 2.59297 1.340158
H  3.568864 -1.331957 2.432627
H  3.011933 0.151132 1.677282
H  1.856351 -1.135105 2.046041
H  3.144883 -3.576314 -0.519032
H  2.03667 -3.379915 0.845646
H  3.776896 -3.474593 1.121176
H  4.634482 -0.121119 -0.311034
H  5.282461 -1.495216 0.575206
H  4.760307 -1.697637 -1.099056
H  2.794704 1.111719 -0.578849
H  1.548929 1.065232 -1.813557
H  -0.824243 -0.388426 1.966509
H  -2.5397 -0.764898 1.782664
H  -3.592805 2.621685 -0.741998
H  -3.902817 1.010265 -0.089247
H  -1.26197 -2.74595 2.542043
H  -1.92763 -3.054194 0.941619
H  -0.212791 -2.649875 1.125938
H  -4.060884 1.945238 2.212314
H  -3.725372 3.568548 1.584147
H  -5.204795 2.730643 1.123061
elementType: S P O C H
totalener: -2042.18907543 hartree
nucrepener: 1715.36021471 hartree
electener: -3757.54929014 hartree
oneelecener: -6226.10834917 hartree
twoeener: 2468.55905903 hartree
cpcmener: -0.02560802 hartree
kineticenergy: 2036.97033120 hartree
xcener: -124.855855437042 hartree
chargesum: 0.0000000
charge: -0.181083 -0.155235 -0.452217 0.628590 -0.331949 -0.356262 0.200397 -0.331062 -0.306032 -0.316780 -0.148117 0.012084 0.013278 -0.225041 -0.242418 0.109050 0.089736 0.101309 0.104416 0.117154 0.102014 0.100989 0.099203 0.095563 0.156205 0.162545 0.100625 0.116449 0.110966 0.112984 0.093287 0.096858 0.055399 0.088021 0.088494 0.090578
qa: -0.1811 -0.1552 -0.4522 0.6286 -0.3319 -0.3563 0.2004 -0.3311 -0.3060 -0.3168 -0.1481 0.0121 0.0133 -0.2250 -0.2424 0.1091 0.0897 0.1013 0.1044 0.1172 0.1020 0.1010 0.0992 0.0956 0.1562 0.1625 0.1006 0.1164 0.1110 0.1130 0.0933 0.0969 0.0554 0.0880 0.0885 0.0906
va: 2.2300 2.2895 2.0184 5.4268 2.0589 2.0702 3.8360 3.9434 3.8912 3.9413 3.9850 3.8473 3.8482 3.9418 3.9685 1.0070 0.9989 0.9998 1.0088 0.9922 1.0035 1.0039 1.0031 1.0134 1.0040 1.0206 0.9969 0.9952 1.0025 0.9870 1.0082 1.0069 1.0234 1.0036 1.0029 1.0065
dispcorr: -0.018446784 hartree
energy: -2042.207522217664
dipole: 8.51295 -8.08106 0.43189 -13.08010 12.64530 -0.43480 17.14310 -14.60745 2.53565
magnitude: 2.60866 au
magnitude: 6.63069 debye
