program: Orca
programVersion: 5.0.2
elementType: S S S P O O C C C C C C C C C H H H H H H H H H H H H H H H H H H H H H
charge: 0
multiplicity: 1
keywords: wb97x-d3
keywords: def2-TZVPP
keywords: def2/J RIJCOSX
keywords: DEFGRID2
keywords: scfconv7
keywords: smallprint printgap noloewdin
keywords: NOSOSCF
formula: C9H21O2PS3
InChI: InChI=1/C9H21O2PS3/c1-6-10-12(13,11-7-2)15-8-14-9(3,4)5/h6-8H2,1-5H3
36 atoms
S  3.01362 0.600508 0.741718
S  0.473881 0.635403 -0.861709
S  -2.618831 0.303502 -1.999892
P  -1.519104 0.276827 -0.419377
O  -1.426491 -1.092916 0.400743
O  -1.945626 1.288859 0.750905
C  3.383235 -1.176187 0.370379
C  2.36284 -2.105232 1.00668
C  3.453761 -1.39697 -1.135497
C  4.759555 -1.404885 0.989891
C  1.227468 0.720849 0.813351
C  -2.621964 -1.754767 0.879671
C  -2.551447 2.570205 0.497322
C  -2.848554 -3.027245 0.106116
C  -1.577623 3.57888 -0.060843
H  1.376501 -2.016709 0.549808
H  2.688327 -3.138211 0.865667
H  2.264748 -1.93158 2.078988
H  4.188229 -0.738983 -1.600578
H  2.491565 -1.226242 -1.616912
H  3.751026 -2.428133 -1.342397
H  5.50448 -0.708687 0.599632
H  4.735266 -1.305017 2.0752
H  5.101195 -2.414016 0.750777
H  0.800204 -0.042085 1.46004
H  1.009492 1.696881 1.244917
H  -2.451457 -1.956344 1.936444
H  -3.488458 -1.094603 0.805841
H  -3.404575 2.438641 -0.170629
H  -2.930553 2.892421 1.46566
H  -3.712538 -3.549215 0.517943
H  -3.048442 -2.821888 -0.945117
H  -1.990385 -3.695437 0.176143
H  -2.074562 4.547395 -0.122737
H  -0.703161 3.692455 0.580196
H  -1.243798 3.31586 -1.064378
elementType: S P O C H
totalener: -2042.18735593 hartree
nucrepener: 1693.22575181 hartree
electener: -3735.41310774 hartree
oneelecener: -6181.53275063 hartree
twoeener: 2446.11964289 hartree
cpcmener: -0.01981958 hartree
kineticenergy: 2036.96389224 hartree
xcener: -124.856824975405 hartree
chargesum: -0.0000000
charge: -0.169367 -0.150924 -0.458555 0.638808 -0.346000 -0.352844 0.176442 -0.311858 -0.317336 -0.293319 -0.140707 0.035984 0.048742 -0.233509 -0.250940 0.078421 0.108203 0.106893 0.098074 0.096364 0.100716 0.104304 0.100911 0.098236 0.139306 0.163754 0.106628 0.091279 0.092139 0.108732 0.094777 0.073572 0.089973 0.105077 0.092086 0.075936
qa: -0.1694 -0.1509 -0.4586 0.6388 -0.3460 -0.3528 0.1764 -0.3119 -0.3173 -0.2933 -0.1407 0.0360 0.0487 -0.2335 -0.2509 0.0784 0.1082 0.1069 0.0981 0.0964 0.1007 0.1043 0.1009 0.0982 0.1393 0.1638 0.1066 0.0913 0.0921 0.1087 0.0948 0.0736 0.0900 0.1051 0.0921 0.0759
va: 2.2458 2.3002 2.0040 5.4122 2.0823 2.0576 3.8431 3.9206 3.9277 3.8913 4.0409 3.8623 3.8366 3.9443 3.9062 1.0182 1.0049 1.0067 1.0123 1.0203 1.0038 1.0061 1.0142 1.0039 1.0144 0.9943 0.9956 1.0055 1.0146 0.9912 1.0080 1.0168 1.0029 1.0124 1.0021 1.0168
dispcorr: -0.017815052 hartree
energy: -2042.205170977720
dipole: 9.40962 -9.53044 -0.12081 -10.28739 9.84089 -0.44650 9.00542 -6.94337 2.06206
magnitude: 2.11330 au
magnitude: 5.37159 debye
