program: Orca
programVersion: 5.0.2
elementType: S S S P O O C C C C C C C C C H H H H H H H H H H H H H H H H H H H H H
charge: 0
multiplicity: 1
keywords: wb97x-d3
keywords: def2-TZVPP
keywords: def2/J RIJCOSX
keywords: DEFGRID2
keywords: scfconv7
keywords: smallprint printgap noloewdin
keywords: NOSOSCF
formula: C9H21O2PS3
InChI: InChI=1/C9H21O2PS3/c1-6-10-12(13,11-7-2)15-8-14-9(3,4)5/h6-8H2,1-5H3
36 atoms
S  1.605422 -1.552489 -0.100141
S  -0.17457 -0.028194 1.715527
S  -0.179617 1.826129 -1.163233
P  -1.231006 0.908118 0.165358
O  -2.279638 -0.162192 -0.403794
O  -2.191462 1.793642 1.086115
C  3.31582 -1.403682 -0.772297
C  4.337871 -1.609465 0.337067
C  3.415148 -2.528205 -1.797148
C  3.518045 -0.058961 -1.455882
C  1.496632 -0.14701 1.028698
C  -1.908742 -1.176302 -1.362622
C  -3.273136 2.549518 0.489815
C  -2.03477 -2.543981 -0.741122
C  -3.624315 3.683929 1.414775
H  5.347782 -1.575446 -0.07897
H  4.276357 -0.832081 1.099554
H  4.208471 -2.57532 0.824637
H  2.699256 -2.397398 -2.610329
H  3.246384 -3.507271 -1.34623
H  4.416214 -2.532882 -2.233215
H  2.760755 0.120554 -2.217661
H  3.494283 0.771226 -0.75043
H  4.497351 -0.039378 -1.939303
H  2.147605 -0.272222 1.894254
H  1.744621 0.793474 0.537984
H  -2.586527 -1.063718 -2.20831
H  -0.893523 -1.004893 -1.725793
H  -2.964548 2.930506 -0.486189
H  -4.123857 1.883493 0.343229
H  -1.355163 -2.667358 0.101751
H  -3.05182 -2.739377 -0.401211
H  -1.781773 -3.298098 -1.486753
H  -4.460206 4.239667 0.990012
H  -3.929301 3.322911 2.397073
H  -2.790017 4.374169 1.536857
elementType: S P O C H
totalener: -2042.18615500 hartree
nucrepener: 1700.20754377 hartree
electener: -3742.39369877 hartree
oneelecener: -6196.09439172 hartree
twoeener: 2453.70069295 hartree
cpcmener: -0.01836411 hartree
kineticenergy: 2036.96572959 hartree
xcener: -124.857741793512 hartree
chargesum: 0.0000000
charge: -0.195327 -0.148823 -0.447841 0.645633 -0.344311 -0.355188 0.208939 -0.322255 -0.290299 -0.328790 -0.115306 0.047870 0.036326 -0.237942 -0.239097 0.100266 0.100096 0.095997 0.105314 0.103421 0.098534 0.095468 0.099146 0.104601 0.156290 0.126165 0.112350 0.069950 0.092052 0.105489 0.063385 0.097910 0.096096 0.088592 0.088903 0.086385
qa: -0.1953 -0.1488 -0.4478 0.6456 -0.3443 -0.3552 0.2089 -0.3223 -0.2903 -0.3288 -0.1153 0.0479 0.0363 -0.2379 -0.2391 0.1003 0.1001 0.0960 0.1053 0.1034 0.0985 0.0955 0.0991 0.1046 0.1563 0.1262 0.1123 0.0699 0.0921 0.1055 0.0634 0.0979 0.0961 0.0886 0.0889 0.0864
va: 2.2338 2.3100 1.9983 5.4140 2.0715 2.1196 3.8625 3.9283 3.8631 3.9378 3.9951 3.8236 3.8467 3.9309 3.9573 1.0033 1.0021 1.0141 1.0096 1.0103 1.0042 1.0157 1.0014 1.0064 0.9958 1.0300 0.9954 1.0330 1.0059 0.9973 1.0223 1.0055 1.0082 1.0067 1.0036 1.0062
dispcorr: -0.017371569 hartree
energy: -2042.203526572974
dipole: 10.93916 -10.61801 0.32115 -7.60258 7.14700 -0.45558 -6.67446 6.43277 -0.24169
magnitude: 0.60754 au
magnitude: 1.54425 debye
