program: Orca
programVersion: 5.0.2
elementType: S S S P O O C C C C C C C C C H H H H H H H H H H H H H H H H H H H H H
charge: 0
multiplicity: 1
keywords: wb97x-d3
keywords: def2-TZVPP
keywords: def2/J RIJCOSX
keywords: DEFGRID2
keywords: scfconv7
keywords: smallprint printgap noloewdin
keywords: NOSOSCF
formula: C9H21O2PS3
InChI: InChI=1/C9H21O2PS3/c1-6-10-12(13,11-7-2)15-8-14-9(3,4)5/h6-8H2,1-5H3
36 atoms
S  1.669097 -1.304766 0.607825
S  0.197626 1.04407 1.606664
S  -0.686631 1.190788 -1.693044
P  -1.2231 0.745337 0.104756
O  -1.744851 -0.737446 0.362458
O  -2.445725 1.590098 0.70675
C  3.020734 -1.661368 -0.590894
C  4.370536 -1.298273 0.009502
C  2.916852 -3.168241 -0.809421
C  2.795617 -0.930933 -1.907475
C  1.709046 0.494306 0.770259
C  -2.454793 -1.488262 -0.647957
C  -2.493129 3.028729 0.612814
C  -1.553333 -2.515934 -1.283315
C  -3.926216 3.452382 0.422888
H  4.546187 -1.8289 0.945468
H  5.172095 -1.563757 -0.683801
H  4.451052 -0.227832 0.205674
H  1.955239 -3.444035 -1.246564
H  3.04119 -3.724889 0.121192
H  3.700915 -3.492876 -1.495825
H  2.922967 0.147433 -1.808953
H  3.526286 -1.274315 -2.643521
H  1.798387 -1.11996 -2.304956
H  2.530783 0.836784 1.399684
H  1.777955 0.992575 -0.196549
H  -3.287132 -1.960852 -0.127719
H  -2.87349 -0.818189 -1.400573
H  -2.076638 3.444253 1.531474
H  -1.877787 3.370256 -0.222101
H  -2.136326 -3.108519 -1.98901
H  -0.73485 -2.046982 -1.828155
H  -1.133321 -3.193411 -0.540771
H  -4.556981 3.117693 1.24652
H  -3.975554 4.540485 0.386362
H  -4.33444 3.065632 -0.510794
elementType: S P O C H
totalener: -2042.18614111 hartree
nucrepener: 1716.38517240 hartree
electener: -3758.57131351 hartree
oneelecener: -6228.59203586 hartree
twoeener: 2470.02072235 hartree
cpcmener: -0.01909174 hartree
kineticenergy: 2036.97905213 hartree
xcener: -124.860793546398 hartree
chargesum: -0.0000000
charge: -0.178875 -0.148848 -0.458509 0.659872 -0.344822 -0.364133 0.188882 -0.315706 -0.294859 -0.327812 -0.122524 0.057615 0.035244 -0.238669 -0.238010 0.094822 0.099509 0.098542 0.105232 0.104298 0.099246 0.098374 0.105223 0.096529 0.156304 0.129717 0.106978 0.085904 0.102499 0.089907 0.104432 0.066657 0.083925 0.089272 0.089488 0.084295
qa: -0.1789 -0.1488 -0.4585 0.6599 -0.3448 -0.3641 0.1889 -0.3157 -0.2949 -0.3278 -0.1225 0.0576 0.0352 -0.2387 -0.2380 0.0948 0.0995 0.0985 0.1052 0.1043 0.0992 0.0984 0.1052 0.0965 0.1563 0.1297 0.1070 0.0859 0.1025 0.0899 0.1044 0.0667 0.0839 0.0893 0.0895 0.0843
va: 2.2120 2.3105 1.9808 5.4120 2.0876 2.0948 3.8678 3.9235 3.8740 3.9479 3.9967 3.8375 3.8438 3.9303 3.9606 1.0142 1.0037 1.0015 1.0061 1.0094 1.0049 1.0015 1.0070 1.0068 0.9959 1.0251 0.9966 1.0141 0.9944 1.0096 1.0115 1.0101 1.0061 1.0035 1.0068 1.0081
dispcorr: -0.017951221 hartree
energy: -2042.204092334781
dipole: 9.29650 -8.85225 0.44425 -9.04846 9.18771 0.13925 -9.57068 9.26739 -0.30329
magnitude: 0.55564 au
magnitude: 1.41232 debye
