program: Orca
programVersion: 5.0.2
elementType: S S S P O O C C C C C C C C C H H H H H H H H H H H H H H H H H H H H H
charge: 0
multiplicity: 1
keywords: wb97x-d3
keywords: def2-TZVPP
keywords: def2/J RIJCOSX
keywords: DEFGRID2
keywords: scfconv7
keywords: smallprint printgap noloewdin
keywords: NOSOSCF
formula: C9H21O2PS3
InChI: InChI=1/C9H21O2PS3/c1-6-10-12(13,11-7-2)15-8-14-9(3,4)5/h6-8H2,1-5H3
36 atoms
S  2.462231 -1.913691 0.537769
S  0.140397 -0.721695 -0.953298
S  -2.485533 1.044495 -1.930899
P  -1.406971 0.549916 -0.414821
O  -2.1643 -0.153285 0.815502
O  -0.626195 1.725659 0.341944
C  3.579454 -0.461896 0.273329
C  4.936406 -0.955678 0.766851
C  3.666223 -0.115147 -1.207687
C  3.132551 0.741725 1.086387
C  0.813619 -1.229333 0.68083
C  -3.324995 -0.989176 0.634513
C  -1.208635 3.032965 0.539013
C  -3.004327 -2.317418 -0.004724
C  -2.335142 3.034293 1.541491
H  4.923375 -1.172469 1.83525
H  5.259176 -1.855435 0.239543
H  5.689107 -0.185587 0.587459
H  2.70989 0.224824 -1.602147
H  3.992877 -0.971155 -1.798627
H  4.391746 0.688979 -1.354528
H  3.893204 1.522004 1.013035
H  2.200819 1.170634 0.716391
H  3.006509 0.498254 2.141982
H  0.187779 -2.027312 1.07836
H  0.786148 -0.396782 1.380349
H  -3.720103 -1.12864 1.639106
H  -4.070374 -0.444171 0.052517
H  -0.380858 3.648871 0.884838
H  -1.539097 3.424499 -0.424972
H  -3.904981 -2.932078 0.000553
H  -2.68607 -2.209605 -1.041424
H  -2.231215 -2.854021 0.545616
H  -2.631879 4.066675 1.728814
H  -3.214262 2.502875 1.176947
H  -2.028395 2.598098 2.491791
elementType: S P O C H
totalener: -2042.18648376 hartree
nucrepener: 1700.13483112 hartree
electener: -3742.32131488 hartree
oneelecener: -6195.36963239 hartree
twoeener: 2453.04831751 hartree
cpcmener: -0.01943431 hartree
kineticenergy: 2036.97033830 hartree
xcener: -124.859194394742 hartree
chargesum: 0.0000000
charge: -0.167838 -0.153556 -0.455289 0.636859 -0.355696 -0.343004 0.177754 -0.290531 -0.319292 -0.317299 -0.144114 0.049482 0.028693 -0.250129 -0.237150 0.101440 0.104615 0.098096 0.094697 0.098024 0.100781 0.107308 0.084691 0.106259 0.162578 0.138476 0.110789 0.093366 0.105408 0.092185 0.106018 0.075505 0.091893 0.099913 0.078684 0.090388
qa: -0.1678 -0.1536 -0.4553 0.6369 -0.3557 -0.3430 0.1778 -0.2905 -0.3193 -0.3173 -0.1441 0.0495 0.0287 -0.2501 -0.2372 0.1014 0.1046 0.0981 0.0947 0.0980 0.1008 0.1073 0.0847 0.1063 0.1626 0.1385 0.1108 0.0934 0.1054 0.0922 0.1060 0.0755 0.0919 0.0999 0.0787 0.0904
va: 2.2497 2.2935 2.0058 5.3952 2.0496 2.0957 3.8521 3.8813 3.9200 3.9199 4.0473 3.8270 3.8664 3.9158 3.8909 1.0142 1.0066 1.0041 1.0246 1.0130 1.0041 1.0046 1.0129 1.0083 0.9939 1.0167 0.9908 1.0127 0.9898 1.0115 1.0122 1.0176 1.0018 1.0090 1.0166 1.0069
dispcorr: -0.018153718 hartree
energy: -2042.204637475297
dipole: 11.09884 -10.91986 0.17898 3.21049 -2.70126 0.50923 11.46513 -9.47644 1.98870
magnitude: 2.06064 au
magnitude: 5.23774 debye
