program: Gaussian 09
title: 000066895
version: EM64L-G09RevD.01
frameworkgroup: C1[X(C12H13N5O2S)]
method: RPBEPBE
basis: SDD
operation: Freq
keyword: #p
keyword: freq=noraman
keyword: PBEPBE/SDD
title: #p freq=noraman PBEPBE/SDD
converged: YES YES NO NO
title: Mulliken charges:
elementType: S O O N N N N N C C C C C C C C C C C C H H H H H H H H H H H H H
charge: 0.942160 -0.546586 -0.544226 -0.149715 -0.125970 -0.715784 -0.663030 -0.689648 -0.053012 -0.221110 -0.215617 0.191548 -0.337516 -0.277723 -0.012557 0.380476 0.588752 -0.594517 -0.233565 -0.443729 0.283383 0.274824 0.258500 0.256836 0.216387 0.273760 0.221739 0.334960 0.326942 0.305564 0.337203 0.318222 0.313050
chargesum: 0.00000
title: Mulliken charges with hydrogens summed into heavy atoms:
elementType: S O O N N N N N C C C C C C C C C C C C
charge: 0.942160 -0.546586 -0.544226 -0.149715 -0.125970 -0.053881 -0.020263 -0.058377 -0.053012 0.062273 0.059208 0.191548 -0.079016 -0.020887 -0.012557 0.380476 0.588752 -0.378131 0.040195 -0.221990
polarizability: 5.57648543e+02 2.11524230e+00 1.99975648e+02 -4.89564860e-01 3.43527034e-02 9.79370086e+01
1716.lowfreq: -5.5744 -1.6590 0.0003 0.0005 0.0015 4.1894 8.2658 22.0214 32.2916
frequency: 5.8822 21.5402 32.2662 48.5309 74.8716 99.6470 124.5922 131.8362 153.9848 198.6283 207.1687 220.6575 238.8830 264.4997 282.0339 299.6687 325.1781 345.8893 352.2631 381.5205 414.1691 416.1034 421.3465 424.6243 446.5530 448.2882 465.6243 482.1029 503.2733 527.6534 543.9325 577.8239 618.1111 635.7260 646.1141 652.4227 730.7977 736.6172 749.1529 792.7625 792.9737 806.8225 810.8711 838.7372 841.7002 861.6192 893.7474 906.4791 944.6259 974.3671 976.7072 983.4044 985.4657 1013.5708 1045.1463 1066.7426 1078.3869 1103.5829 1121.1481 1148.7419 1183.1750 1242.7958 1264.4476 1273.8573 1287.7981 1326.2282 1358.5128 1385.3203 1408.4085 1428.4101 1455.3654 1500.8905 1508.6033 1532.1245 1557.7241 1573.0151 1587.3008 1598.0163 1640.0880 1648.0498 3123.1141 3131.5489 3151.7786 3153.8757 3167.5513 3172.6585 3177.4183 3361.2092 3514.9756 3529.6453 3557.2577 3685.9676 3697.4228
redmass: 5.3807 3.9552 4.9621 6.3136 5.0625 1.6352 7.3192 4.4373 9.0021 5.7028 4.2553 5.9083 8.4467 2.6566 5.1998 8.8761 3.4636 3.4248 5.9006 4.0736 1.3199 2.4849 6.1639 1.1868 1.3846 3.7331 2.9432 3.2384 5.5290 6.3216 2.9622 5.3925 7.1814 1.5102 2.0392 6.0816 3.0896 6.2400 2.2808 2.1333 6.9206 1.6148 3.4988 1.2622 2.2507 1.6136 6.8897 4.1524 2.5798 1.3386 1.3765 3.0736 1.5484 1.5304 2.5615 1.4571 1.3772 1.3884 1.6660 1.2724 1.8313 2.1262 2.8762 1.5016 1.6115 7.1684 2.9861 5.9762 4.4882 5.8647 2.3750 3.7242 3.7870 1.0862 4.5809 5.8079 5.7293 1.5499 4.2955 1.2853 1.0912 1.0892 1.0890 1.0881 1.0951 1.0967 1.0951 1.0413 1.0464 1.0999 1.0452 1.1019 1.1040
irintensity: 0.4150 3.0545 1.2706 0.2216 3.5841 33.4006 2.3338 4.7051 0.8165 6.6849 5.2220 11.4710 4.3160 4.9917 17.3508 1.1054 14.9535 4.7643 1.0073 4.6931 83.5115 26.8265 106.7035 79.0404 277.6907 6.4004 31.6622 102.4960 42.1954 49.5282 86.1557 19.3811 1.6259 31.5983 68.3913 13.0273 1.0087 1.4488 3.9820 43.6880 23.8201 19.3351 301.7754 5.5021 90.7047 64.6054 4.5458 67.4279 4.2470 0.0498 1.1098 5.5238 1.5064 4.3873 83.7952 29.9929 4.4579 26.4505 144.5430 19.7721 6.0254 51.6988 55.7210 120.1698 72.8177 1154.5024 25.8825 11.3261 19.2862 2.9345 33.5922 23.7146 11.1862 13.2804 106.6512 39.7232 78.6178 208.7486 452.1222 483.6759 31.1915 20.2631 0.3827 1.5985 11.4625 3.8317 1.8276 27.6282 28.4750 21.7743 228.1709 55.6184 25.0578
temp: 298.150 k
press: 1.00000 atm
elementType: 16 8 8 7 7 7 7 7 6 6 6 6 6 6 6 6 6 6 6 6 1 1 1 1 1 1 1 1 1 1 1 1 1
symmnumber: 1
zpe: 636545.7 jmol-1
zpe.correction: 0.242447 hartree
zpe.thermalcorrener: 0.262248 hartree
zpe.thermalcorrenthalpy: 0.263192 hartree
zpe.thermalcorrgfe: 0.191294 hartree
zpe.sumelectzpe: -1285.707194 hartree
zpe.sumelectthermal: -1285.687394 hartree
zpe.sumelectthermalent: -1285.686449 hartree
zpe.sumelectthermalfe: -1285.758347 hartree
dipole: 10.3776 1.2538 2.8968
dipole: 10.8470
quadrupole: -83.8199 -109.2112 -132.9831
quadrupole: 5.1414 -19.9857 -0.0172
quadrupole: 24.8515 -0.5398 -24.3117 5.1414 -19.9857 -0.0172
hfenergy: -1285.9496415 hartree
pointgroup: C01 [X(C12H13N5O2S1)]
dipole: -4.0171754 1.1969214 0.801012 debye
polarizability: 556.3904152|-13.9121402|99.8241178|-17.781194|-11.6096069|199.3466661 unknown
InChI: InChI=1S/C12H13N5O2S/c13-8-1-6-12(11(14)7-8)17-16-9-2-4-10(5-3-9)20(15,18)19/h1-7H,13-15H2
charge 0 multiplicity 1
33 atoms
S  5.462398 -0.450252 -0.308236
O  5.817269 -1.242699 1.071262
O  6.05591 -0.883375 -1.764026
N  -0.575501 -0.078852 -0.9396
N  -1.331606 -0.185198 0.141592
N  5.985623 1.293831 0.005837
N  -2.896639 -0.449395 2.338874
N  -6.928105 0.211996 -0.336597
C  3.59932 -0.329975 -0.461925
C  3.046772 -0.217147 -1.74904
C  2.829813 -0.380157 0.716141
C  0.824509 -0.176355 -0.689819
C  1.644945 -0.138183 -1.853098
C  1.431953 -0.303267 0.596703
C  -2.708588 -0.077461 -0.056346
C  -3.525726 -0.219181 1.134712
C  -5.548089 0.113715 -0.226271
C  -4.936141 -0.119951 1.029651
C  -3.351988 0.156595 -1.310934
C  -4.736109 0.252791 -1.408857
H  3.693035 -0.215616 -2.632268
H  3.318612 -0.495669 1.688944
H  1.153653 -0.049635 -2.826888
H  0.791362 -0.337521 1.481853
H  -5.555786 -0.226613 1.928451
H  -2.711222 0.258224 -2.192171
H  -5.219439 0.433793 -2.37587
H  6.59252 1.282646 0.843134
H  6.468304 1.644315 -0.838612
H  -3.414477 -0.560728 3.205032
H  -1.878189 -0.510701 2.325292
H  -7.364982 0.378447 -1.239047
H  -7.529614 0.118179 0.477426
