program: Orca
programVersion: 5.0.2
elementType: S S S P O O C C C C C C C C C H H H H H H H H H H H H H H H H H H H H H
charge: 0
multiplicity: 1
keywords: wb97x-d3
keywords: def2-TZVPP
keywords: def2/J RIJCOSX
keywords: DEFGRID2
keywords: scfconv7
keywords: smallprint printgap noloewdin
keywords: NOSOSCF
formula: C9H21O2PS3
InChI: InChI=1/C9H21O2PS3/c1-6-10-12(13,11-7-2)15-8-14-9(3,4)5/h6-8H2,1-5H3
36 atoms
S  1.556286 -1.571073 0.229117
S  -0.174035 0.266079 1.826349
S  0.02127 1.990227 -1.130725
P  -1.07808 0.961565 0.066076
O  -1.731235 -0.283553 -0.695208
O  -2.283702 1.72515 0.798769
C  3.199324 -1.444834 -0.600954
C  3.185295 -0.330213 -1.636596
C  4.302389 -1.220128 0.42323
C  3.381818 -2.795048 -1.286731
C  1.504397 -0.064442 1.225593
C  -2.683735 -1.175862 -0.072924
C  -3.030837 2.768522 0.13531
C  -2.10839 -2.563275 0.051006
C  -3.817173 2.277648 -1.055723
H  4.149378 -0.292918 -2.14935
H  2.410405 -0.491614 -2.385199
H  3.018014 0.648592 -1.187087
H  5.27276 -1.222818 -0.076897
H  4.312274 -2.003823 1.179501
H  4.205264 -0.259226 0.928789
H  2.582447 -2.999713 -2.000885
H  4.323734 -2.797805 -1.838373
H  3.414939 -3.613847 -0.567018
H  2.105528 -0.158535 2.129869
H  1.855762 0.802344 0.665511
H  -2.998573 -0.799666 0.902046
H  -3.561754 -1.172383 -0.718313
H  -3.694736 3.157625 0.90394
H  -2.343283 3.565864 -0.151546
H  -1.273548 -2.592193 0.749746
H  -2.883485 -3.233503 0.422879
H  -1.769638 -2.94564 -0.911431
H  -3.172638 1.965028 -1.877017
H  -4.477719 1.452364 -0.791268
H  -4.436657 3.095732 -1.423259
elementType: S P O C H
totalener: -2042.18596768 hartree
nucrepener: 1722.17705876 hartree
electener: -3764.36302645 hartree
oneelecener: -6240.26124684 hartree
twoeener: 2475.89822039 hartree
cpcmener: -0.02130898 hartree
kineticenergy: 2036.97054426 hartree
xcener: -124.860227505315 hartree
chargesum: -0.0000000
charge: -0.205440 -0.152837 -0.438770 0.625695 -0.335296 -0.357819 0.206031 -0.316072 -0.323323 -0.289117 -0.119717 0.040918 0.027607 -0.239583 -0.250096 0.104603 0.087727 0.091989 0.102231 0.099641 0.097283 0.104529 0.098799 0.101853 0.156338 0.131241 0.093761 0.106258 0.110600 0.097739 0.067954 0.103469 0.090310 0.082706 0.091950 0.106835
qa: -0.2054 -0.1528 -0.4388 0.6257 -0.3353 -0.3578 0.2060 -0.3161 -0.3233 -0.2891 -0.1197 0.0409 0.0276 -0.2396 -0.2501 0.1046 0.0877 0.0920 0.1022 0.0996 0.0973 0.1045 0.0988 0.1019 0.1563 0.1312 0.0938 0.1063 0.1106 0.0977 0.0680 0.1035 0.0903 0.0827 0.0919 0.1068
va: 2.2199 2.2985 2.0254 5.4127 2.0459 2.0678 3.8719 3.9427 3.9272 3.8606 4.0037 3.8536 3.8577 3.9412 3.8850 1.0065 1.0184 1.0056 1.0039 1.0119 1.0010 1.0098 1.0042 1.0131 0.9964 1.0214 0.9988 0.9926 0.9919 1.0099 1.0178 1.0097 1.0053 1.0204 1.0038 1.0090
dispcorr: -0.018377370 hartree
energy: -2042.204345052162
dipole: 7.35576 -7.86433 -0.50856 -10.80637 10.38236 -0.42401 -7.20380 7.69804 0.49423
magnitude: 0.82625 au
magnitude: 2.10015 debye
