program: Orca
programVersion: 5.0.2
elementType: S S S P O O C C C C C C C C C H H H H H H H H H H H H H H H H H H H H H
charge: 0
multiplicity: 1
keywords: wb97x-d3
keywords: def2-TZVPP
keywords: def2/J RIJCOSX
keywords: DEFGRID2
keywords: scfconv7
keywords: smallprint printgap noloewdin
keywords: NOSOSCF
formula: C9H21O2PS3
InChI: InChI=1/C9H21O2PS3/c1-6-10-12(13,11-7-2)15-8-14-9(3,4)5/h6-8H2,1-5H3
36 atoms
S  2.459829 -1.891695 0.288009
S  -0.019349 -0.897532 -1.120539
S  -2.556806 1.060324 -1.965138
P  -1.405757 0.519422 -0.519126
O  -2.123772 -0.06344 0.79233
O  -0.472517 1.645453 0.132107
C  3.413064 -0.314511 0.420737
C  4.865063 -0.783558 0.462368
C  3.188322 0.576987 -0.79191
C  3.067157 0.42523 1.704113
C  0.74069 -1.41774 0.476005
C  -3.320968 -0.862302 0.741408
C  -0.937989 2.989336 0.382744
C  -3.080368 -2.258845 0.22231
C  -1.867276 3.083542 1.567549
H  5.139247 -1.341263 -0.434827
H  5.52272 0.085538 0.522894
H  5.064371 -1.412318 1.331255
H  3.841031 1.451199 -0.724883
H  2.162095 0.93693 -0.850874
H  3.417762 0.055427 -1.721333
H  2.048297 0.81487 1.69733
H  3.187624 -0.209875 2.582094
H  3.732773 1.284347 1.815815
H  0.206505 -2.299741 0.825229
H  0.626098 -0.640802 1.228369
H  -3.676195 -0.889865 1.770017
H  -4.071735 -0.345318 0.140778
H  -0.029727 3.562636 0.557954
H  -1.411577 3.377777 -0.52095
H  -3.99789 -2.835774 0.341039
H  -2.819823 -2.266836 -0.835501
H  -2.293133 -2.766025 0.780876
H  -1.428016 2.6352 2.458495
H  -2.051301 4.136787 1.781458
H  -2.832221 2.614662 1.376501
elementType: S P O C H
totalener: -2042.18679833 hartree
nucrepener: 1709.02608207 hartree
electener: -3751.21288040 hartree
oneelecener: -6213.04827998 hartree
twoeener: 2461.83539959 hartree
cpcmener: -0.02015739 hartree
kineticenergy: 2036.96361275 hartree
xcener: -124.857738018379 hartree
chargesum: 0.0000000
charge: -0.167942 -0.153762 -0.456544 0.634324 -0.350113 -0.345036 0.187544 -0.286071 -0.312369 -0.329939 -0.139424 0.047308 0.027104 -0.254035 -0.238713 0.105094 0.099207 0.103819 0.102451 0.079253 0.096621 0.094172 0.103807 0.103949 0.162830 0.135884 0.108762 0.092679 0.106037 0.095554 0.106922 0.079306 0.091276 0.090257 0.100068 0.079720
qa: -0.1679 -0.1538 -0.4565 0.6343 -0.3501 -0.3450 0.1875 -0.2861 -0.3124 -0.3299 -0.1394 0.0473 0.0271 -0.2540 -0.2387 0.1051 0.0992 0.1038 0.1025 0.0793 0.0966 0.0942 0.1038 0.1039 0.1628 0.1359 0.1088 0.0927 0.1060 0.0956 0.1069 0.0793 0.0913 0.0903 0.1001 0.0797
va: 2.2499 2.2805 2.0129 5.4087 2.0606 2.0867 3.8800 3.8481 3.9017 3.9318 4.0368 3.8312 3.8569 3.9109 3.9050 1.0096 1.0043 1.0129 1.0063 1.0271 1.0163 1.0073 1.0133 1.0026 0.9961 1.0230 0.9908 1.0142 0.9899 1.0132 1.0124 1.0160 1.0021 1.0054 1.0089 1.0145
dispcorr: -0.018692742 hartree
energy: -2042.205491068713
dipole: 11.27711 -11.02007 0.25704 4.58854 -4.08693 0.50160 14.74772 -12.49172 2.25600
magnitude: 2.32534 au
magnitude: 5.91054 debye
