program: Orca
programVersion: 5.0.2
elementType: S S S P O O C C C C C C C C C H H H H H H H H H H H H H H H H H H H H H
charge: 0
multiplicity: 1
keywords: wb97x-d3
keywords: def2-TZVPP
keywords: def2/J RIJCOSX
keywords: DEFGRID2
keywords: scfconv7
keywords: smallprint printgap noloewdin
keywords: NOSOSCF
formula: C9H21O2PS3
InChI: InChI=1/C9H21O2PS3/c1-6-10-12(13,11-7-2)15-8-14-9(3,4)5/h6-8H2,1-5H3
36 atoms
S  2.987498 -0.573911 1.02297
S  0.010112 -0.384438 1.299334
S  -0.901469 1.038376 -1.668104
P  -1.382057 0.662546 0.165867
O  -2.68904 -0.234594 0.397034
O  -1.683462 1.94443 1.073338
C  3.174457 -1.301163 -0.663997
C  4.345871 -2.266236 -0.511417
C  1.923149 -2.053883 -1.093168
C  3.521786 -0.213905 -1.670638
C  1.558019 0.500836 0.875414
C  -3.133567 -1.232193 -0.545495
C  -2.31844 3.126659 0.540789
C  -2.310133 -2.495171 -0.489625
C  -3.753034 2.897127 0.132882
H  4.553051 -2.736367 -1.474551
H  5.25552 -1.754945 -0.191887
H  4.128338 -3.059846 0.204713
H  2.113377 -2.552522 -2.046927
H  1.072982 -1.386858 -1.239502
H  1.638799 -2.814001 -0.366114
H  3.708173 -0.664879 -2.648276
H  2.709133 0.5025 -1.799769
H  4.416676 0.334362 -1.376566
H  1.689085 1.32691 1.571022
H  1.473745 0.915248 -0.129598
H  -4.166925 -1.431164 -0.26885
H  -3.130622 -0.80655 -1.549906
H  -2.25707 3.854404 1.347811
H  -1.728012 3.501752 -0.297114
H  -2.278458 -2.910266 0.517212
H  -2.767435 -3.238754 -1.14283
H  -1.288108 -2.337833 -0.834274
H  -4.194818 3.856055 -0.138896
H  -3.835907 2.242162 -0.734885
H  -4.342587 2.478018 0.9478
elementType: S P O C H
totalener: -2042.18684762 hartree
nucrepener: 1707.17144744 hartree
electener: -3749.35829507 hartree
oneelecener: -6209.70010990 hartree
twoeener: 2460.34181484 hartree
cpcmener: -0.01736085 hartree
kineticenergy: 2036.97630836 hartree
xcener: -124.861381010860 hartree
chargesum: 0.0000000
charge: -0.172419 -0.151295 -0.462218 0.661325 -0.363780 -0.361405 0.193931 -0.290868 -0.302629 -0.319963 -0.110714 0.047991 0.030782 -0.245044 -0.242638 0.099272 0.105353 0.104035 0.107005 0.049288 0.099460 0.101905 0.097589 0.098882 0.165876 0.112112 0.110906 0.093589 0.111012 0.093129 0.092769 0.104031 0.073062 0.100419 0.077697 0.091551
qa: -0.1724 -0.1513 -0.4622 0.6613 -0.3638 -0.3614 0.1939 -0.2909 -0.3026 -0.3200 -0.1107 0.0480 0.0308 -0.2450 -0.2426 0.0993 0.1054 0.1040 0.1070 0.0493 0.0995 0.1019 0.0976 0.0989 0.1659 0.1121 0.1109 0.0936 0.1110 0.0931 0.0928 0.1040 0.0731 0.1004 0.0777 0.0916
va: 2.2326 2.3058 1.9735 5.4007 2.0775 2.0992 3.8772 3.8618 3.9070 3.9441 3.9697 3.8357 3.8617 3.9242 3.8941 1.0038 1.0102 1.0116 1.0090 1.0325 1.0131 1.0025 1.0012 1.0144 1.0025 1.0507 0.9912 1.0132 0.9912 1.0130 1.0037 1.0127 0.9987 1.0085 1.0169 1.0071
dispcorr: -0.018427373 hartree
energy: -2042.205274996125
dipole: 4.13893 -4.78387 -0.64494 -7.30773 7.32149 0.01376 -10.86518 10.22579 -0.63939
magnitude: 0.90827 au
magnitude: 2.30864 debye
