program: Orca
programVersion: 5.0.2
elementType: S S S P O O C C C C C C C C C H H H H H H H H H H H H H H H H H H H H H
charge: 0
multiplicity: 1
keywords: wb97x-d3
keywords: def2-TZVPP
keywords: def2/J RIJCOSX
keywords: DEFGRID2
keywords: scfconv7
keywords: smallprint printgap noloewdin
keywords: NOSOSCF
formula: C9H21O2PS3
InChI: InChI=1/C9H21O2PS3/c1-6-10-12(13,11-7-2)15-8-14-9(3,4)5/h6-8H2,1-5H3
36 atoms
S  1.89322 -1.054581 0.791718
S  0.310332 1.401456 1.316287
S  -0.745033 0.574369 -1.823542
P  -1.15456 0.600128 0.058581
O  -1.539434 -0.788388 0.741763
O  -2.417624 1.479687 0.507662
C  3.136802 -1.588294 -0.458384
C  4.442691 -0.829952 -0.269338
C  3.337727 -3.073035 -0.173205
C  2.593964 -1.397127 -1.867142
C  1.805955 0.733226 0.537226
C  -1.823688 -1.986368 -0.006972
C  -2.588563 2.841223 0.062387
C  -3.234122 -1.987026 -0.53878
C  -4.058175 3.168771 0.091501
H  5.190614 -1.205051 -0.972357
H  4.328208 0.238494 -0.459163
H  4.8368 -0.955329 0.739964
H  2.405796 -3.632629 -0.270376
H  3.736771 -3.244301 0.827512
H  4.048041 -3.48806 -0.890905
H  3.321538 -1.768359 -2.593059
H  1.661847 -1.942725 -2.011076
H  2.407488 -0.349042 -2.1006
H  2.636077 1.254852 1.01401
H  1.796657 0.988914 -0.521986
H  -1.093668 -2.098547 -0.810135
H  -1.669567 -2.799322 0.700428
H  -2.024949 3.500021 0.725764
H  -2.187777 2.953128 -0.947408
H  -3.386882 -1.201588 -1.279379
H  -3.433627 -2.943581 -1.022633
H  -3.962753 -1.858409 0.261516
H  -4.622619 2.523628 -0.58136
H  -4.472196 3.077569 1.095551
H  -4.198639 4.199183 -0.234621
elementType: S P O C H
totalener: -2042.18687233 hartree
nucrepener: 1715.72938454 hartree
electener: -3757.91625686 hartree
oneelecener: -6227.24372536 hartree
twoeener: 2469.32746850 hartree
cpcmener: -0.01878288 hartree
kineticenergy: 2036.98338429 hartree
xcener: -124.862662335764 hartree
chargesum: 0.0000000
charge: -0.184134 -0.156883 -0.451400 0.660938 -0.351118 -0.364404 0.192275 -0.320954 -0.290205 -0.321436 -0.119713 0.059473 0.037629 -0.243878 -0.241139 0.101040 0.098354 0.098037 0.104181 0.102938 0.098478 0.106272 0.093093 0.091935 0.155376 0.132331 0.081169 0.111291 0.099857 0.090651 0.076533 0.096800 0.091279 0.086537 0.089758 0.089041
qa: -0.1841 -0.1569 -0.4514 0.6609 -0.3511 -0.3644 0.1923 -0.3210 -0.2902 -0.3214 -0.1197 0.0595 0.0376 -0.2439 -0.2411 0.1010 0.0984 0.0980 0.1042 0.1029 0.0985 0.1063 0.0931 0.0919 0.1554 0.1323 0.0812 0.1113 0.0999 0.0907 0.0765 0.0968 0.0913 0.0865 0.0898 0.0890
va: 2.2078 2.3108 1.9884 5.4034 2.0780 2.0955 3.8657 3.9229 3.8680 3.9522 3.9928 3.8296 3.8494 3.9389 3.9597 1.0040 1.0003 1.0127 1.0095 1.0117 1.0044 1.0069 1.0081 1.0050 0.9970 1.0247 1.0155 0.9915 0.9941 1.0070 1.0187 1.0078 1.0061 1.0069 1.0033 1.0061
dispcorr: -0.017461669 hartree
energy: -2042.204333994436
dipole: 6.15070 -5.58515 0.56555 -8.82091 8.86745 0.04654 -8.14659 7.71938 -0.42721
magnitude: 0.71030 au
magnitude: 1.80543 debye
