program: Orca
programVersion: 5.0.2
elementType: S S S P O O C C C C C C C C C H H H H H H H H H H H H H H H H H H H H H
charge: 0
multiplicity: 1
keywords: wb97x-d3
keywords: def2-TZVPP
keywords: def2/J RIJCOSX
keywords: DEFGRID2
keywords: scfconv7
keywords: smallprint printgap noloewdin
keywords: NOSOSCF
formula: C9H21O2PS3
InChI: InChI=1/C9H21O2PS3/c1-6-10-12(13,11-7-2)15-8-14-9(3,4)5/h6-8H2,1-5H3
36 atoms
S  1.686995 -0.803792 1.228181
S  0.71477 0.803903 -1.231325
S  -2.445705 0.790733 -2.204396
P  -1.27956 0.867138 -0.673834
O  -1.480502 -0.280762 0.429651
O  -1.360952 2.171067 0.246797
C  3.234551 -1.549198 0.561645
C  3.256765 -2.951351 1.163104
C  3.195512 -1.635281 -0.956412
C  4.447273 -0.756465 1.029327
C  1.572968 0.779774 0.395579
C  -1.541467 -1.665336 0.034874
C  -2.599842 2.873592 0.486645
C  -1.748487 -2.501516 1.269215
C  -3.544975 2.110204 1.380346
H  4.166998 -3.465388 0.848635
H  3.251587 -2.927911 2.25409
H  2.405914 -3.547111 0.829551
H  3.210043 -0.651117 -1.426716
H  2.312018 -2.168278 -1.307891
H  4.078875 -2.171617 -1.311752
H  4.503256 -0.720083 2.117432
H  5.36296 -1.223226 0.658365
H  4.435552 0.268777 0.656183
H  1.082681 1.481497 1.067928
H  2.564822 1.187993 0.197457
H  -2.364039 -1.799258 -0.670699
H  -0.60985 -1.938274 -0.465753
H  -2.295789 3.809736 0.951653
H  -3.067665 3.109428 -0.471179
H  -0.921898 -2.39144 1.970412
H  -2.677967 -2.244706 1.777554
H  -1.806007 -3.550803 0.979761
H  -4.397099 2.749358 1.613595
H  -3.931328 1.211168 0.900226
H  -3.069706 1.83082 2.320381
elementType: S P O C H
totalener: -2042.18915836 hartree
nucrepener: 1713.77651206 hartree
electener: -3755.96567041 hartree
oneelecener: -6222.87793378 hartree
twoeener: 2466.91226336 hartree
cpcmener: -0.02029339 hartree
kineticenergy: 2036.97116182 hartree
xcener: -124.859085729560 hartree
chargesum: -0.0000000
charge: -0.168362 -0.150303 -0.460143 0.635903 -0.340305 -0.351394 0.201459 -0.296599 -0.333647 -0.320706 -0.158516 0.013729 0.027772 -0.243420 -0.234074 0.100450 0.104686 0.105385 0.090002 0.105029 0.107883 0.095322 0.100012 0.101880 0.164387 0.156774 0.114635 0.098381 0.110047 0.092731 0.081615 0.092711 0.091449 0.099512 0.075268 0.090447
qa: -0.1684 -0.1503 -0.4601 0.6359 -0.3403 -0.3514 0.2015 -0.2966 -0.3336 -0.3207 -0.1585 0.0137 0.0278 -0.2434 -0.2341 0.1004 0.1047 0.1054 0.0900 0.1050 0.1079 0.0953 0.1000 0.1019 0.1644 0.1568 0.1146 0.0984 0.1100 0.0927 0.0816 0.0927 0.0914 0.0995 0.0753 0.0904
va: 2.2467 2.3079 2.0029 5.4139 2.0430 2.0875 3.8339 3.8728 3.9419 3.9350 4.0110 3.8141 3.8631 3.9452 3.8879 1.0038 1.0091 1.0093 0.9971 1.0069 1.0063 1.0140 1.0029 1.0035 1.0158 1.0039 1.0147 1.0048 0.9903 1.0106 1.0136 1.0043 1.0051 1.0092 1.0206 1.0065
dispcorr: -0.018075998 hartree
energy: -2042.207234355551
dipole: 12.50380 -11.17921 1.32458 -13.47092 13.05356 -0.41736 13.51294 -12.06268 1.45026
magnitude: 2.00797 au
magnitude: 5.10386 debye
