program: Orca
programVersion: 5.0.2
elementType: S S S P O O C C C C C C C C C H H H H H H H H H H H H H H H H H H H H H
charge: 0
multiplicity: 1
keywords: wb97x-d3
keywords: def2-TZVPP
keywords: def2/J RIJCOSX
keywords: DEFGRID2
keywords: scfconv7
keywords: smallprint printgap noloewdin
keywords: NOSOSCF
formula: C9H21O2PS3
InChI: InChI=1/C9H21O2PS3/c1-6-10-12(13,11-7-2)15-8-14-9(3,4)5/h6-8H2,1-5H3
36 atoms
S  2.791024 -1.542251 -0.36503
S  -0.141474 -1.581932 0.575856
S  -1.477931 0.565286 -1.729082
P  -1.37448 0.035089 0.12488
O  -2.75104 -0.410702 0.812387
O  -0.880271 1.143985 1.162924
C  3.165668 0.238146 -0.051965
C  4.688075 0.30442 -0.153086
C  2.535186 1.137404 -1.103684
C  2.725476 0.6430 1.348067
C  1.060012 -1.627662 -0.814648
C  -3.682981 -1.275694 0.128668
C  -1.38991 2.499577 1.106306
C  -4.854484 -0.478131 -0.386626
C  -0.388943 3.415402 0.448602
H  5.022148 1.317654 0.079104
H  5.173352 -0.369814 0.555684
H  5.039393 0.057027 -1.155566
H  2.896715 2.159083 -0.966914
H  1.4479 1.17232 -1.028843
H  2.795847 0.822632 -2.114897
H  1.648516 0.563793 1.476472
H  3.201335 0.022983 2.108142
H  3.008082 1.681812 1.537268
H  0.776727 -0.877211 -1.553173
H  0.929771 -2.600311 -1.288112
H  -3.185998 -1.812656 -0.682878
H  -3.999808 -2.014122 0.864625
H  -2.351546 2.53007 0.588461
H  -1.566659 2.785856 2.142698
H  -5.582433 -1.154936 -0.834857
H  -5.352517 0.061679 0.41919
H  -4.544952 0.23793 -1.148017
H  0.585092 3.358021 0.937001
H  -0.264529 3.18081 -0.608277
H  -0.743141 4.444005 0.526135
elementType: S P O C H
totalener: -2042.18488918 hartree
nucrepener: 1722.46374784 hartree
electener: -3764.64863702 hartree
oneelecener: -6240.20861806 hartree
twoeener: 2475.55998104 hartree
cpcmener: -0.01670129 hartree
kineticenergy: 2036.95917458 hartree
xcener: -124.856500223688 hartree
chargesum: -0.0000000
charge: -0.168966 -0.154596 -0.451287 0.662015 -0.371218 -0.343193 0.213107 -0.295952 -0.306229 -0.334277 -0.125478 0.046513 0.048045 -0.241626 -0.256150 0.099283 0.105049 0.102404 0.107677 0.042835 0.111658 0.078247 0.101336 0.103090 0.125423 0.167772 0.083076 0.109778 0.093547 0.108478 0.096268 0.090017 0.075673 0.089744 0.078936 0.109001
qa: -0.1690 -0.1546 -0.4513 0.6620 -0.3712 -0.3432 0.2131 -0.2960 -0.3062 -0.3343 -0.1255 0.0465 0.0480 -0.2416 -0.2561 0.0993 0.1050 0.1024 0.1077 0.0428 0.1117 0.0782 0.1013 0.1031 0.1254 0.1678 0.0831 0.1098 0.0935 0.1085 0.0963 0.0900 0.0757 0.0897 0.0789 0.1090
va: 2.2365 2.3098 1.9784 5.4060 2.0893 2.0788 3.8228 3.8761 3.9184 3.9207 4.0001 3.8524 3.8480 3.9390 3.9230 1.0033 1.0075 1.0137 1.0040 1.0266 1.0156 1.0342 1.0180 1.0028 1.0461 0.9923 1.0128 0.9946 1.0068 0.9971 1.0078 1.0036 1.0184 0.9999 1.0109 1.0111
dispcorr: -0.019486658 hartree
energy: -2042.204375838718
dipole: 6.53566 -7.13905 -0.60338 14.34559 -13.50801 0.83758 0.28464 -0.01943 0.26521
magnitude: 1.06581 au
magnitude: 2.70906 debye
