program: Orca
programVersion: 5.0.2
elementType: S S S P O O C C C C C C C C C H H H H H H H H H H H H H H H H H H H H H
charge: 0
multiplicity: 1
keywords: wb97x-d3
keywords: def2-TZVPP
keywords: def2/J RIJCOSX
keywords: DEFGRID2
keywords: scfconv7
keywords: smallprint printgap noloewdin
keywords: NOSOSCF
formula: C9H21O2PS3
InChI: InChI=1/C9H21O2PS3/c1-6-10-12(13,11-7-2)15-8-14-9(3,4)5/h6-8H2,1-5H3
36 atoms
S  1.574794 -1.60165 -0.168919
S  -0.20116 -0.333143 1.84745
S  -0.167499 1.94393 -0.711246
P  -1.238544 0.83679 0.442255
O  -2.27511 -0.138901 -0.29103
O  -2.233828 1.569662 1.455081
C  3.211036 -1.243476 -0.939944
C  4.32079 -1.341708 0.096648
C  3.374934 -2.33618 -1.99138
C  3.204833 0.125197 -1.605958
C  1.469897 -0.369504 1.148129
C  -1.891166 -1.009071 -1.375874
C  -2.852636 2.832496 1.116172
C  -2.008382 -2.4490 -0.94707
C  -3.857507 2.722682 -0.003582
H  5.289515 -1.1929 -0.387068
H  4.2271 -0.580435 0.872894
H  4.333009 -2.320148 0.578473
H  2.571522 -2.311819 -2.729532
H  3.398385 -3.330245 -1.542634
H  4.316838 -2.188613 -2.523372
H  3.061912 0.934693 -0.890082
H  4.164999 0.295244 -2.099507
H  2.420052 0.197804 -2.358497
H  2.11579 -0.622814 1.988807
H  1.732264 0.627144 0.795046
H  -2.568624 -0.786603 -2.199776
H  -0.876751 -0.780809 -1.708709
H  -3.33237 3.15622 2.037836
H  -2.072285 3.55508 0.870391
H  -3.023938 -2.691887 -0.634284
H  -1.754403 -3.094312 -1.788321
H  -1.32649 -2.680781 -0.129737
H  -4.62963 1.985872 0.215263
H  -4.344779 3.690494 -0.126691
H  -3.389689 2.471966 -0.9556
elementType: S P O C H
totalener: -2042.18428043 hartree
nucrepener: 1719.72931788 hartree
electener: -3761.91359831 hartree
oneelecener: -6235.17009338 hartree
twoeener: 2473.25649507 hartree
cpcmener: -0.01749338 hartree
kineticenergy: 2036.98175564 hartree
xcener: -124.862928863238 hartree
chargesum: 0.0000000
charge: -0.198743 -0.153809 -0.443519 0.653625 -0.343868 -0.365442 0.209086 -0.322539 -0.291886 -0.319995 -0.116991 0.049363 0.029317 -0.238757 -0.239214 0.101202 0.099121 0.097089 0.105049 0.103359 0.098711 0.094263 0.105695 0.091947 0.155904 0.127900 0.112665 0.070340 0.110536 0.094363 0.097927 0.096242 0.062868 0.090992 0.099077 0.078123
qa: -0.1987 -0.1538 -0.4435 0.6536 -0.3439 -0.3654 0.2091 -0.3225 -0.2919 -0.3200 -0.1170 0.0494 0.0293 -0.2388 -0.2392 0.1012 0.0991 0.0971 0.1050 0.1034 0.0987 0.0943 0.1057 0.0919 0.1559 0.1279 0.1127 0.0703 0.1105 0.0944 0.0979 0.0962 0.0629 0.0910 0.0991 0.0781
va: 2.2236 2.3046 1.9993 5.3894 2.0677 2.1046 3.8579 3.9250 3.8647 3.9436 4.0023 3.8253 3.8670 3.9329 3.8868 1.0038 1.0008 1.0131 1.0093 1.0114 1.0044 1.0042 1.0069 1.0129 0.9977 1.0270 0.9947 1.0283 0.9906 1.0091 1.0059 1.0082 1.0219 1.0072 1.0085 1.0197
dispcorr: -0.018210772 hartree
energy: -2042.202491207335
dipole: 10.79181 -10.23829 0.55352 -6.46805 6.38481 -0.08324 -12.10302 11.68736 -0.41566
magnitude: 0.69719 au
magnitude: 1.77213 debye
