program: Orca
programVersion: 5.0.2
elementType: S S S P O O C C C C C C C C C H H H H H H H H H H H H H H H H H H H H H
charge: 0
multiplicity: 1
keywords: wb97x-d3
keywords: def2-TZVPP
keywords: def2/J RIJCOSX
keywords: DEFGRID2
keywords: scfconv7
keywords: smallprint printgap noloewdin
keywords: NOSOSCF
formula: C9H21O2PS3
InChI: InChI=1/C9H21O2PS3/c1-6-10-12(13,11-7-2)15-8-14-9(3,4)5/h6-8H2,1-5H3
36 atoms
S  1.643325 -1.049196 1.122394
S  0.366998 0.937668 -0.871724
S  -2.731528 0.849655 -1.90359
P  -1.614948 0.587859 -0.358734
O  -1.65496 -0.841418 0.358698
O  -1.951337 1.446202 0.948194
C  3.284777 -1.31796 0.324999
C  3.547199 -2.809075 0.511771
C  3.24779 -0.975335 -1.156805
C  4.353686 -0.503164 1.039423
C  1.240313 0.651995 0.717226
C  -1.431982 -2.039834 -0.410028
C  -2.47636 2.786536 0.870073
C  -1.509123 -3.217619 0.524103
C  -1.461701 3.796468 0.392955
H  2.801017 -3.417759 -0.000714
H  4.525115 -3.059538 0.096192
H  3.554978 -3.092348 1.565766
H  3.109198 0.092641 -1.33049
H  2.455277 -1.513349 -1.677082
H  4.201001 -1.250531 -1.614675
H  5.328895 -0.691229 0.583769
H  4.167998 0.569796 0.969184
H  4.418703 -0.767712 2.094877
H  0.639106 1.05911 1.529083
H  2.141598 1.26357 0.667369
H  -2.192033 -2.109096 -1.191278
H  -0.450617 -1.988876 -0.886597
H  -3.36062 2.788362 0.230058
H  -2.797135 3.011868 1.885379
H  -1.356411 -4.133212 -0.047043
H  -0.737048 -3.168339 1.29156
H  -2.483778 -3.285128 1.007666
H  -1.890863 4.793717 0.493714
H  -0.549074 3.763367 0.98831
H  -1.199209 3.655633 -0.655007
elementType: S P O C H
totalener: -2042.18976517 hartree
nucrepener: 1716.39192925 hartree
electener: -3758.58169442 hartree
oneelecener: -6227.95681471 hartree
twoeener: 2469.37512029 hartree
cpcmener: -0.02116484 hartree
kineticenergy: 2036.97828754 hartree
xcener: -124.862051523474 hartree
chargesum: 0.0000000
charge: -0.171234 -0.151244 -0.456871 0.631778 -0.345957 -0.351271 0.204793 -0.296435 -0.334431 -0.323170 -0.143835 0.004027 0.040257 -0.242632 -0.253566 0.104897 0.100045 0.104721 0.088527 0.105274 0.108959 0.099970 0.102486 0.095203 0.156534 0.157852 0.118000 0.097132 0.095791 0.112219 0.090637 0.081221 0.092974 0.105636 0.093250 0.078463
qa: -0.1712 -0.1512 -0.4569 0.6318 -0.3460 -0.3513 0.2048 -0.2964 -0.3344 -0.3232 -0.1438 0.0040 0.0403 -0.2426 -0.2536 0.1049 0.1000 0.1047 0.0885 0.1053 0.1090 0.1000 0.1025 0.0952 0.1565 0.1579 0.1180 0.0971 0.0958 0.1122 0.0906 0.0812 0.0930 0.1056 0.0933 0.0785
va: 2.2481 2.2918 2.0131 5.4493 2.0857 2.0878 3.8266 3.8758 3.9395 3.9390 3.9997 3.8227 3.8335 3.9457 3.8986 1.0097 1.0040 1.0085 0.9976 1.0064 1.0063 1.0027 1.0035 1.0139 1.0193 1.0034 1.0111 1.0060 1.0134 0.9920 1.0051 1.0137 1.0052 1.0111 1.0044 1.0158
dispcorr: -0.018255670 hartree
energy: -2042.208020840740
dipole: 20.78680 -18.77939 2.00741 -7.58256 7.72074 0.13818 6.23469 -5.30245 0.93224
magnitude: 2.21762 au
magnitude: 5.63675 debye
