program: Orca
programVersion: 5.0.2
elementType: S S S P O O C C C C C C C C C H H H H H H H H H H H H H H H H H H H H H
charge: 0
multiplicity: 1
keywords: wb97x-d3
keywords: def2-TZVPP
keywords: def2/J RIJCOSX
keywords: DEFGRID2
keywords: scfconv7
keywords: smallprint printgap noloewdin
keywords: NOSOSCF
formula: C9H21O2PS3
InChI: InChI=1/C9H21O2PS3/c1-6-10-12(13,11-7-2)15-8-14-9(3,4)5/h6-8H2,1-5H3
36 atoms
S  2.065271 -0.165734 1.199983
S  0.503768 -0.023282 -1.470986
S  -2.741825 -0.322804 -1.763972
P  -1.350514 0.487675 -0.705447
O  -1.314716 0.142308 0.858741
O  -1.319992 2.083484 -0.645265
C  3.48163 -1.238484 0.699204
C  4.704759 -0.390789 0.37893
C  3.749982 -2.095247 1.932714
C  3.112827 -2.121344 -0.483131
C  1.672258 0.758118 -0.287109
C  -1.391436 -1.223233 1.317255
C  -2.529838 2.873854 -0.631634
C  -2.783006 -1.547186 1.799913
C  -3.287299 2.772991 0.669989
H  5.548425 -1.040842 0.134567
H  4.543828 0.259472 -0.482198
H  4.994208 0.231155 1.225882
H  2.892707 -2.719921 2.187779
H  4.002342 -1.487375 2.803343
H  4.596601 -2.755994 1.736393
H  2.215911 -2.708399 -0.285863
H  2.949551 -1.543373 -1.393793
H  3.932619 -2.814105 -0.688655
H  1.280886 1.729276 0.01043
H  2.570678 0.95748 -0.87049
H  -1.078922 -1.910981 0.527695
H  -0.662808 -1.306568 2.120941
H  -2.191656 3.893391 -0.805767
H  -3.158192 2.579952 -1.474505
H  -2.79072 -2.556145 2.213293
H  -3.102162 -0.862522 2.585994
H  -3.508585 -1.510911 0.987994
H  -3.716108 1.782387 0.82467
H  -2.6563 3.019985 1.523544
H  -4.11172 3.486183 0.647434
elementType: S P O C H
totalener: -2042.18803751 hartree
nucrepener: 1705.40106809 hartree
electener: -3747.58910560 hartree
oneelecener: -6206.17385429 hartree
twoeener: 2458.58474869 hartree
cpcmener: -0.02033363 hartree
kineticenergy: 2036.96449604 hartree
xcener: -124.858249440021 hartree
chargesum: -0.0000000
charge: -0.167564 -0.149015 -0.463263 0.640819 -0.346949 -0.352436 0.202502 -0.326257 -0.294114 -0.330578 -0.159325 0.056557 0.027247 -0.252103 -0.233746 0.100615 0.103254 0.096434 0.105044 0.104702 0.099455 0.102014 0.090156 0.106551 0.161998 0.156005 0.086420 0.097466 0.110603 0.092977 0.099718 0.089900 0.079022 0.074639 0.091084 0.100170
qa: -0.1676 -0.1490 -0.4633 0.6408 -0.3469 -0.3524 0.2025 -0.3263 -0.2941 -0.3306 -0.1593 0.0566 0.0272 -0.2521 -0.2337 0.1006 0.1033 0.0964 0.1050 0.1047 0.0995 0.1020 0.0902 0.1066 0.1620 0.1560 0.0864 0.0975 0.1106 0.0930 0.0997 0.0899 0.0790 0.0746 0.0911 0.1002
va: 2.2392 2.3136 1.9916 5.4171 2.0443 2.0894 3.8385 3.9333 3.8690 3.9359 4.0192 3.8321 3.8624 3.9654 3.8926 1.0025 1.0030 1.0140 1.0105 1.0095 1.0041 1.0115 0.9976 1.0060 1.0164 1.0054 1.0093 1.0025 0.9905 1.0108 1.0087 1.0030 1.0186 1.0148 1.0066 1.0097
dispcorr: -0.017924028 hartree
energy: -2042.205961536730
dipole: 12.68989 -11.20428 1.48560 -5.49731 5.81839 0.32108 13.72447 -12.56951 1.15497
magnitude: 1.90894 au
magnitude: 4.85215 debye
