program: Orca
programVersion: 5.0.2
elementType: S S S P O O C C C C C C C C C H H H H H H H H H H H H H H H H H H H H H
charge: 0
multiplicity: 1
keywords: wb97x-d3
keywords: def2-TZVPP
keywords: def2/J RIJCOSX
keywords: DEFGRID2
keywords: scfconv7
keywords: smallprint printgap noloewdin
keywords: NOSOSCF
formula: C9H21O2PS3
InChI: InChI=1/C9H21O2PS3/c1-6-10-12(13,11-7-2)15-8-14-9(3,4)5/h6-8H2,1-5H3
36 atoms
S  1.730092 -1.342304 0.614439
S  0.131024 0.823443 1.836829
S  -0.541758 1.209887 -1.479222
P  -1.185285 0.585779 0.225964
O  -1.678298 -0.928514 0.313669
O  -2.475877 1.306148 0.841429
C  3.215497 -1.477133 -0.467633
C  3.293036 -2.962186 -0.807628
C  3.036743 -0.662067 -1.740143
C  4.461809 -1.040523 0.28908
C  1.704513 0.414424 1.037692
C  -1.72698 -1.811374 -0.825861
C  -2.603313 2.74453 0.833144
C  -2.998781 -1.629743 -1.614757
C  -3.515307 3.190291 -0.281224
H  4.16398 -3.144693 -1.440183
H  3.397028 -3.57973 0.085955
H  2.410665 -3.297757 -1.355538
H  2.981877 0.408165 -1.541863
H  2.134532 -0.952486 -2.277072
H  3.892231 -0.824073 -2.400063
H  4.596221 -1.618652 1.203257
H  5.345579 -1.188284 -0.335866
H  4.428236 0.016739 0.556407
H  2.473415 0.672987 1.765999
H  1.828112 1.046009 0.158267
H  -0.845172 -1.656084 -1.448488
H  -1.664477 -2.813983 -0.406344
H  -3.011726 3.010869 1.807109
H  -1.622236 3.216953 0.74792
H  -3.062118 -0.634172 -2.05387
H  -3.019037 -2.354211 -2.429715
H  -3.881679 -1.796822 -0.99789
H  -3.635036 4.272747 -0.233136
H  -3.102995 2.940081 -1.258387
H  -4.504051 2.740646 -0.192449
elementType: S P O C H
totalener: -2042.18587397 hartree
nucrepener: 1722.01660588 hartree
electener: -3764.20247985 hartree
oneelecener: -6239.82141953 hartree
twoeener: 2475.61893969 hartree
cpcmener: -0.01872048 hartree
kineticenergy: 2036.98704367 hartree
xcener: -124.864575760515 hartree
chargesum: -0.0000000
charge: -0.181585 -0.155786 -0.448356 0.657905 -0.357587 -0.370559 0.195028 -0.293240 -0.321340 -0.323833 -0.122900 0.067127 0.049060 -0.243737 -0.242767 0.098912 0.103308 0.105505 0.094827 0.093597 0.105726 0.097393 0.100860 0.099694 0.154716 0.132405 0.076411 0.112139 0.110338 0.083942 0.075145 0.095579 0.091365 0.095076 0.074723 0.090911
qa: -0.1816 -0.1558 -0.4484 0.6579 -0.3576 -0.3706 0.1950 -0.2932 -0.3213 -0.3238 -0.1229 0.0671 0.0491 -0.2437 -0.2428 0.0989 0.1033 0.1055 0.0948 0.0936 0.1057 0.0974 0.1009 0.0997 0.1547 0.1324 0.0764 0.1121 0.1103 0.0839 0.0751 0.0956 0.0914 0.0951 0.0747 0.0909
va: 2.2130 2.3116 1.9843 5.4107 2.0752 2.0776 3.8607 3.8672 3.9459 3.9249 3.9951 3.8176 3.8474 3.9467 3.9380 1.0043 1.0110 1.0084 1.0046 1.0106 1.0064 1.0131 1.0038 0.9999 0.9975 1.0258 1.0207 0.9912 0.9940 1.0121 1.0179 1.0074 1.0059 1.0080 1.0203 1.0032
dispcorr: -0.017716088 hartree
energy: -2042.203590056700
dipole: 9.23505 -8.46403 0.77102 -5.85608 6.00277 0.14669 -11.61388 11.27408 -0.33981
magnitude: 0.85525 au
magnitude: 2.17387 debye
