program: Orca
programVersion: 5.0.2
elementType: S S S P O O C C C C C C C C C H H H H H H H H H H H H H H H H H H H H H
charge: 0
multiplicity: 1
keywords: wb97x-d3
keywords: def2-TZVPP
keywords: def2/J RIJCOSX
keywords: DEFGRID2
keywords: scfconv7
keywords: smallprint printgap noloewdin
keywords: NOSOSCF
formula: C9H21O2PS3
InChI: InChI=1/C9H21O2PS3/c1-6-10-12(13,11-7-2)15-8-14-9(3,4)5/h6-8H2,1-5H3
36 atoms
S  1.769668 -1.301909 0.963618
S  0.007516 1.062972 1.466685
S  -0.353138 1.732641 -1.851536
P  -1.105933 0.884588 -0.296938
O  -1.401184 -0.653322 -0.574576
O  -2.516709 1.422843 0.231439
C  2.813681 -1.707046 -0.501853
C  4.140277 -0.964902 -0.433153
C  3.040315 -3.210873 -0.383214
C  2.074315 -1.39316 -1.793685
C  1.645363 0.504138 0.911812
C  -1.952047 -1.559422 0.406408
C  -2.741004 2.824063 0.502053
C  -1.633349 -2.967285 -0.021699
C  -4.176818 3.152785 0.190615
H  4.674706 -1.186186 0.49118
H  4.775062 -1.265446 -1.270363
H  4.009323 0.116253 -0.498825
H  3.566147 -3.471818 0.536244
H  3.648347 -3.552887 -1.223085
H  2.100004 -3.764792 -0.409982
H  1.851316 -0.331159 -1.899709
H  2.691605 -1.681044 -2.648361
H  1.134417 -1.941845 -1.857008
H  2.354652 0.968248 1.595766
H  1.839668 0.898554 -0.086316
H  -1.523771 -1.349192 1.388644
H  -3.029691 -1.39844 0.460542
H  -2.514011 3.009964 1.552847
H  -2.06593 3.431853 -0.104609
H  -2.083711 -3.663722 0.685723
H  -2.036668 -3.189884 -1.009805
H  -0.557503 -3.143273 -0.030541
H  -4.865159 2.553991 0.786969
H  -4.357812 4.201608 0.425299
H  -4.401246 3.000687 -0.864846
elementType: S P O C H
totalener: -2042.18763162 hartree
nucrepener: 1722.25799163 hartree
electener: -3764.44562326 hartree
oneelecener: -6239.97926838 hartree
twoeener: 2475.53364512 hartree
cpcmener: -0.01963620 hartree
kineticenergy: 2036.97222507 hartree
xcener: -124.858616547619 hartree
chargesum: -0.0000000
charge: -0.189717 -0.164569 -0.447129 0.646492 -0.333885 -0.355169 0.205428 -0.319294 -0.300064 -0.332399 -0.104149 0.000195 0.037312 -0.225534 -0.240148 0.098217 0.101129 0.099415 0.103756 0.100332 0.110640 0.085307 0.108153 0.093965 0.161647 0.123810 0.101629 0.119203 0.103870 0.091819 0.098160 0.093534 0.062563 0.089589 0.089642 0.086251
qa: -0.1897 -0.1646 -0.4471 0.6465 -0.3339 -0.3552 0.2054 -0.3193 -0.3001 -0.3324 -0.1041 0.0002 0.0373 -0.2255 -0.2401 0.0982 0.1011 0.0994 0.1038 0.1003 0.1106 0.0853 0.1082 0.0940 0.1616 0.1238 0.1016 0.1192 0.1039 0.0918 0.0982 0.0935 0.0626 0.0896 0.0896 0.0863
va: 2.2020 2.2950 2.0153 5.4367 2.0927 2.0950 3.8479 3.9275 3.8758 3.9372 3.9761 3.8512 3.8400 3.9177 3.9678 1.0130 1.0039 1.0004 1.0118 1.0036 1.0006 1.0187 1.0098 1.0098 0.9968 1.0303 1.0043 0.9998 0.9912 1.0076 1.0088 1.0051 1.0241 1.0036 1.0065 1.0072
dispcorr: -0.018760847 hartree
energy: -2042.206392472087
dipole: 6.26209 -6.22472 0.03738 -12.62274 12.29733 -0.32541 -2.60462 3.67927 1.07465
magnitude: 1.12345 au
magnitude: 2.85559 debye
