program: Orca
programVersion: 5.0.2
elementType: S S S P O O C C C C C C C C C H H H H H H H H H H H H H H H H H H H H H
charge: 0
multiplicity: 1
keywords: wb97x-d3
keywords: def2-TZVPP
keywords: def2/J RIJCOSX
keywords: DEFGRID2
keywords: scfconv7
keywords: smallprint printgap noloewdin
keywords: NOSOSCF
formula: C9H21O2PS3
InChI: InChI=1/C9H21O2PS3/c1-6-10-12(13,11-7-2)15-8-14-9(3,4)5/h6-8H2,1-5H3
36 atoms
S  2.889791 0.059211 0.866945
S  -0.081077 0.226008 1.301979
S  -1.071005 0.611437 -1.936066
P  -1.624865 0.43113 -0.095674
O  -2.549089 -0.818454 0.281106
O  -2.630916 1.549672 0.44809
C  3.040797 -1.210052 -0.464172
C  4.254611 -2.03274 -0.042251
C  1.805298 -2.094183 -0.540567
C  3.302857 -0.537431 -1.804179
C  1.382558 0.943711 0.462017
C  -2.140298 -2.163324 -0.040528
C  -2.526997 2.930628 0.051936
C  -3.342624 -3.061037 0.088423
C  -1.310495 3.621339 0.619232
H  4.452295 -2.79765 -0.795345
H  5.152588 -1.418662 0.046903
H  4.089572 -2.538292 0.910358
H  0.928953 -1.542497 -0.881848
H  1.572303 -2.548827 0.422016
H  1.981977 -2.897223 -1.260417
H  2.465595 0.085635 -2.123345
H  4.19793 0.083858 -1.7728
H  3.446796 -1.298575 -2.574891
H  1.501381 1.970002 0.80559
H  1.202986 0.966089 -0.613741
H  -1.742711 -2.192828 -1.057434
H  -1.34615 -2.468794 0.643621
H  -2.540296 2.99618 -1.037763
H  -3.439811 3.39068 0.425776
H  -3.750038 -3.045773 1.099166
H  -4.128685 -2.779295 -0.611765
H  -3.044854 -4.085135 -0.135753
H  -1.379347 4.686431 0.395735
H  -1.248621 3.510002 1.701668
H  -0.382407 3.259404 0.174982
elementType: S P O C H
totalener: -2042.18710303 hartree
nucrepener: 1709.10289845 hartree
electener: -3751.29000148 hartree
oneelecener: -6213.20540768 hartree
twoeener: 2461.91540620 hartree
cpcmener: -0.01871697 hartree
kineticenergy: 2036.96845514 hartree
xcener: -124.860219820773 hartree
chargesum: -0.0000000
charge: -0.173268 -0.164686 -0.450456 0.653735 -0.349966 -0.357567 0.197199 -0.293883 -0.298498 -0.321588 -0.119553 0.045393 0.038954 -0.248722 -0.252555 0.100003 0.104525 0.104820 0.045598 0.100160 0.106973 0.098058 0.098105 0.101671 0.166731 0.124113 0.096276 0.098874 0.095580 0.110522 0.089333 0.088864 0.089038 0.105628 0.094131 0.076457
qa: -0.1733 -0.1647 -0.4505 0.6537 -0.3500 -0.3576 0.1972 -0.2939 -0.2985 -0.3216 -0.1196 0.0454 0.0390 -0.2487 -0.2526 0.1000 0.1045 0.1048 0.0456 0.1002 0.1070 0.0981 0.0981 0.1017 0.1667 0.1241 0.0963 0.0989 0.0956 0.1105 0.0893 0.0889 0.0890 0.1056 0.0941 0.0765
va: 2.2407 2.2976 1.9962 5.4254 2.1108 2.1056 3.8696 3.8658 3.9145 3.9488 3.9824 3.8290 3.8521 3.9820 3.8891 1.0035 1.0101 1.0112 1.0276 1.0143 1.0099 1.0009 1.0139 1.0026 0.9923 1.0480 0.9964 0.9939 1.0116 0.9919 1.0035 1.0055 1.0053 1.0110 1.0064 1.0092
dispcorr: -0.018522875 hartree
energy: -2042.205625902562
dipole: 9.84772 -9.50607 0.34164 -8.64616 8.45955 -0.18661 -5.10218 4.91371 -0.18848
magnitude: 0.43251 au
magnitude: 1.09936 debye
