program: Orca
programVersion: 5.0.2
elementType: S S S P O O C C C C C C C C C H H H H H H H H H H H H H H H H H H H H H
charge: 0
multiplicity: 1
keywords: wb97x-d3
keywords: def2-TZVPP
keywords: def2/J RIJCOSX
keywords: DEFGRID2
keywords: scfconv7
keywords: smallprint printgap noloewdin
keywords: NOSOSCF
formula: C9H21O2PS3
InChI: InChI=1/C9H21O2PS3/c1-6-10-12(13,11-7-2)15-8-14-9(3,4)5/h6-8H2,1-5H3
36 atoms
S  1.982697 0.091862 0.918223
S  -0.567153 -1.383765 1.266757
S  -1.039627 -0.044857 -1.852382
P  -1.481557 0.024057 0.023193
O  -3.024775 -0.212708 0.391619
O  -1.18582 1.38951 0.793996
C  3.435807 0.031384 -0.210782
C  3.001038 -0.057637 -1.665792
C  4.140082 1.361837 0.035943
C  4.345364 -1.131697 0.157751
C  1.096905 -1.437517 0.544142
C  -3.922172 -0.985509 -0.430389
C  -1.364956 2.671301 0.148171
C  -3.685277 -2.470914 -0.323831
C  -0.035528 3.252932 -0.260528
H  2.524855 -1.009273 -1.90043
H  2.30667 0.740876 -1.92459
H  3.877265 0.029372 -2.312612
H  4.448155 1.474162 1.076355
H  3.500594 2.207066 -0.224977
H  5.037443 1.419674 -0.583194
H  3.847748 -2.093598 0.026777
H  5.230407 -1.13368 -0.483376
H  4.681498 -1.063298 1.192355
H  1.007556 -1.604602 -0.528791
H  1.571297 -2.310639 0.993468
H  -4.916355 -0.725069 -0.071432
H  -3.840665 -0.650215 -1.465587
H  -2.032431 2.579038 -0.71069
H  -1.861608 3.303228 0.883486
H  -2.720108 -2.763068 -0.737286
H  -3.742582 -2.815683 0.708373
H  -4.457937 -2.989228 -0.892391
H  0.631265 3.362519 0.594053
H  0.458303 2.634936 -1.009175
H  -0.198333 4.242488 -0.688779
elementType: S P O C H
totalener: -2042.18489630 hartree
nucrepener: 1730.23753121 hartree
electener: -3772.42242751 hartree
oneelecener: -6256.37191528 hartree
twoeener: 2483.94948777 hartree
cpcmener: -0.01877087 hartree
kineticenergy: 2036.98330094 hartree
xcener: -124.863084660269 hartree
chargesum: -0.0000000
charge: -0.180509 -0.145780 -0.458371 0.667111 -0.372066 -0.349182 0.191510 -0.327126 -0.295805 -0.317534 -0.122204 0.039565 0.051687 -0.247942 -0.239228 0.097027 0.096363 0.105468 0.104544 0.105000 0.099325 0.099298 0.099245 0.094829 0.128675 0.155883 0.109633 0.093107 0.087049 0.106945 0.074687 0.091521 0.102615 0.083078 0.066952 0.104630
qa: -0.1805 -0.1458 -0.4584 0.6671 -0.3721 -0.3492 0.1915 -0.3271 -0.2958 -0.3175 -0.1222 0.0396 0.0517 -0.2479 -0.2392 0.0970 0.0964 0.1055 0.1045 0.1050 0.0993 0.0993 0.0992 0.0948 0.1287 0.1559 0.1096 0.0931 0.0870 0.1069 0.0747 0.0915 0.1026 0.0831 0.0670 0.1046
va: 2.2140 2.3018 1.9778 5.3895 2.0876 2.0864 3.8670 3.9482 3.8719 3.9237 3.9954 3.8567 3.8510 3.8949 3.9297 1.0024 1.0066 1.0069 1.0096 1.0069 1.0048 1.0013 1.0039 1.0138 1.0262 0.9962 0.9917 1.0142 1.0114 0.9963 1.0184 1.0037 1.0109 1.0061 1.0116 1.0113
dispcorr: -0.018513929 hartree
energy: -2042.203410231841
dipole: 15.75296 -15.54145 0.21151 3.05856 -3.20949 -0.15092 -7.45222 6.92128 -0.53095
magnitude: 0.59112 au
magnitude: 1.50250 debye
