program: Orca
programVersion: 5.0.2
elementType: S S S P O O C C C C C C C C C H H H H H H H H H H H H H H H H H H H H H
charge: 0
multiplicity: 1
keywords: wb97x-d3
keywords: def2-TZVPP
keywords: def2/J RIJCOSX
keywords: DEFGRID2
keywords: scfconv7
keywords: smallprint printgap noloewdin
keywords: NOSOSCF
formula: C9H21O2PS3
InChI: InChI=1/C9H21O2PS3/c1-6-10-12(13,11-7-2)15-8-14-9(3,4)5/h6-8H2,1-5H3
36 atoms
S  1.806382 -1.554008 0.751368
S  -0.185177 0.455898 1.710933
S  -0.09729 2.113574 -1.272805
P  -1.009697 0.81808 -0.179311
O  -1.177291 -0.565475 -0.944898
O  -2.508819 1.161556 0.26284
C  3.118373 -1.424334 -0.53741
C  3.450136 -2.875651 -0.869215
C  2.583989 -0.716807 -1.773447
C  4.346347 -0.716015 0.015592
C  1.554074 0.15991 1.274801
C  -1.732346 -1.77004 -0.368892
C  -2.893105 2.456806 0.771631
C  -3.185801 -1.941037 -0.733669
C  -4.314042 2.733467 0.356694
H  2.577716 -3.416969 -1.239165
H  4.210785 -2.901283 -1.651888
H  3.843542 -3.410806 -0.004258
H  3.358346 -0.687169 -2.544056
H  2.289942 0.312733 -1.568613
H  1.71897 -1.237493 -2.184815
H  4.733457 -1.222021 0.900676
H  5.136471 -0.704916 -0.739352
H  4.137167 0.321496 0.280753
H  2.117461 0.385591 2.179068
H  1.857518 0.870562 0.50593
H  -1.131692 -2.581949 -0.774749
H  -1.592011 -1.770425 0.713481
H  -2.795019 2.441892 1.858196
H  -2.219369 3.221358 0.379366
H  -3.521116 -2.915562 -0.376043
H  -3.820322 -1.184048 -0.275041
H  -3.334879 -1.916358 -1.812984
H  -4.411903 2.772641 -0.727939
H  -5.000897 1.981119 0.744221
H  -4.618669 3.700482 0.756529
elementType: S P O C H
totalener: -2042.18636773 hartree
nucrepener: 1715.76566448 hartree
electener: -3757.95203221 hartree
oneelecener: -6227.07198347 hartree
twoeener: 2469.11995126 hartree
cpcmener: -0.01930194 hartree
kineticenergy: 2036.97118562 hartree
xcener: -124.858717512101 hartree
chargesum: -0.0000000
charge: -0.190339 -0.163246 -0.446596 0.644149 -0.339161 -0.352607 0.205836 -0.294239 -0.332892 -0.320519 -0.104690 0.051674 0.033420 -0.246805 -0.240191 0.105062 0.099025 0.103683 0.106031 0.088578 0.094535 0.097982 0.101016 0.098719 0.160069 0.123761 0.098674 0.092289 0.102737 0.091281 0.095868 0.081167 0.087764 0.086160 0.090151 0.091652
qa: -0.1903 -0.1632 -0.4466 0.6441 -0.3392 -0.3526 0.2058 -0.2942 -0.3329 -0.3205 -0.1047 0.0517 0.0334 -0.2468 -0.2402 0.1051 0.0990 0.1037 0.1060 0.0886 0.0945 0.0980 0.1010 0.0987 0.1601 0.1238 0.0987 0.0923 0.1027 0.0913 0.0959 0.0812 0.0878 0.0862 0.0902 0.0917
va: 2.2048 2.2936 2.0151 5.4332 2.0851 2.1037 3.8544 3.8666 3.9335 3.9290 3.9793 3.8279 3.8447 3.9665 3.9600 1.0102 1.0037 1.0120 1.0096 1.0168 1.0128 1.0127 1.0036 1.0006 0.9972 1.0293 0.9958 1.0112 0.9928 1.0100 1.0060 1.0144 1.0044 1.0074 1.0029 1.0071
dispcorr: -0.018185910 hartree
energy: -2042.204553643599
dipole: 4.29365 -4.42715 -0.13350 -8.86859 8.30401 -0.56457 -4.70754 5.60809 0.90055
magnitude: 1.07124 au
magnitude: 2.72287 debye
