program: Orca
programVersion: 5.0.2
elementType: S S S P O O C C C C C C C C C H H H H H H H H H H H H H H H H H H H H H
charge: 0
multiplicity: 1
keywords: wb97x-d3
keywords: def2-TZVPP
keywords: def2/J RIJCOSX
keywords: DEFGRID2
keywords: scfconv7
keywords: smallprint printgap noloewdin
keywords: NOSOSCF
formula: C9H21O2PS3
InChI: InChI=1/C9H21O2PS3/c1-6-10-12(13,11-7-2)15-8-14-9(3,4)5/h6-8H2,1-5H3
36 atoms
S  2.067293 -0.130269 1.176442
S  0.165665 -0.737443 -1.195342
S  -2.717235 0.727419 -1.808314
P  -1.584998 0.035541 -0.411823
O  -2.141891 -1.195852 0.442989
O  -1.204745 1.0610 0.759853
C  3.691916 -0.191958 0.306915
C  4.48778 0.950791 0.928691
C  4.385269 -1.519992 0.575219
C  3.528384 0.039356 -1.187763
C  1.063033 -1.326339 0.298849
C  -3.41442 -1.090451 1.128603
C  -1.091704 2.482356 0.553919
C  -4.430841 -1.986519 0.469953
C  0.110214 2.873696 -0.270195
H  4.593697 0.832409 2.008262
H  5.491236 0.970716 0.499776
H  4.023476 1.918274 0.73477
H  3.821328 -2.366707 0.180878
H  4.539647 -1.682514 1.641452
H  5.361883 -1.53116 0.086974
H  2.986727 0.961726 -1.398177
H  4.514204 0.110974 -1.65285
H  3.005996 -0.783586 -1.67747
H  1.668613 -2.161602 -0.050508
H  0.345404 -1.746372 1.000059
H  -3.22874 -1.389624 2.159372
H  -3.764816 -0.056581 1.144802
H  -2.013534 2.851192 0.10059
H  -1.023487 2.898669 1.557346
H  -4.104435 -3.026649 0.462585
H  -5.367661 -1.934546 1.025623
H  -4.629245 -1.674618 -0.555366
H  0.177134 3.961766 -0.289854
H  1.032692 2.480737 0.155409
H  0.02943 2.529474 -1.301228
elementType: S P O C H
totalener: -2042.18727600 hartree
nucrepener: 1707.58472366 hartree
electener: -3749.77199965 hartree
oneelecener: -6210.56266930 hartree
twoeener: 2460.79066964 hartree
cpcmener: -0.02062932 hartree
kineticenergy: 2036.97760153 hartree
xcener: -124.861005710718 hartree
chargesum: 0.0000000
charge: -0.173916 -0.144075 -0.465651 0.650799 -0.360902 -0.348537 0.204570 -0.298479 -0.319983 -0.335398 -0.155974 0.044527 0.037640 -0.233521 -0.241273 0.104264 0.100477 0.108124 0.102104 0.095027 0.100007 0.105113 0.108092 0.088544 0.155244 0.161793 0.105579 0.087832 0.096259 0.111768 0.089002 0.093903 0.072658 0.104770 0.078069 0.071544
qa: -0.1739 -0.1441 -0.4657 0.6508 -0.3609 -0.3485 0.2046 -0.2985 -0.3200 -0.3354 -0.1560 0.0445 0.0376 -0.2335 -0.2413 0.1043 0.1005 0.1081 0.1021 0.0950 0.1000 0.1051 0.1081 0.0885 0.1552 0.1618 0.1056 0.0878 0.0963 0.1118 0.0890 0.0939 0.0727 0.1048 0.0781 0.0715
va: 2.2341 2.3022 1.9927 5.4131 2.0771 2.0598 3.8269 3.8805 3.9396 3.9426 4.0179 3.8683 3.8308 3.9386 3.8921 1.0088 1.0039 1.0046 1.0032 1.0142 1.0028 1.0042 1.0066 0.9970 1.0056 1.0166 0.9954 1.0051 1.0154 0.9916 1.0040 1.0079 1.0176 1.0150 1.0250 1.0195
dispcorr: -0.018269306 hartree
energy: -2042.205545301290
dipole: 17.79440 -16.48010 1.31430 1.16508 -1.38618 -0.22110 6.72524 -5.29682 1.42842
magnitude: 1.95362 au
magnitude: 4.96571 debye
