program: Orca
programVersion: 5.0.2
elementType: S S S P O O C C C C C C C C C H H H H H H H H H H H H H H H H H H H H H
charge: 0
multiplicity: 1
keywords: wb97x-d3
keywords: def2-TZVPP
keywords: def2/J RIJCOSX
keywords: DEFGRID2
keywords: scfconv7
keywords: smallprint printgap noloewdin
keywords: NOSOSCF
formula: C9H21O2PS3
InChI: InChI=1/C9H21O2PS3/c1-6-10-12(13,11-7-2)15-8-14-9(3,4)5/h6-8H2,1-5H3
36 atoms
S  1.934239 -0.58053 1.232969
S  0.241659 0.332965 -1.193622
S  -2.992236 0.128375 -1.533484
P  -1.602175 0.492119 -0.248974
O  -1.566009 -0.399348 1.075315
O  -1.607164 1.91052 0.494735
C  3.392405 -1.301185 0.365778
C  4.549649 -0.312538 0.364946
C  3.750838 -2.527203 1.200183
C  3.038224 -1.719022 -1.053329
C  1.414598 0.754938 0.154814
C  -2.04919 -1.757938 1.103519
C  -1.565217 3.14216 -0.258168
C  -1.203606 -2.716689 0.301994
C  -2.929512 3.781632 -0.311565
H  4.314115 0.597881 -0.188762
H  4.83336 -0.02907 1.378979
H  5.421303 -0.763652 -0.116478
H  2.944129 -3.261978 1.205414
H  3.981499 -2.263516 2.234118
H  4.636227 -3.006403 0.777401
H  3.888899 -2.239672 -1.500166
H  2.180407 -2.391631 -1.074722
H  2.819278 -0.862694 -1.693209
H  0.975938 1.535418 0.775655
H  2.271765 1.210392 -0.342071
H  -2.040296 -2.025393 2.158534
H  -3.0859 -1.773617 0.762385
H  -0.850722 3.780619 0.25991
H  -1.17484 2.965491 -1.263358
H  -1.578721 -3.727432 0.466807
H  -1.257805 -2.516579 -0.768181
H  -0.158781 -2.68391 0.60937
H  -3.640998 3.164117 -0.858897
H  -3.32279 3.968086 0.687965
H  -2.852277 4.741438 -0.822872
elementType: S P O C H
totalener: -2042.18774042 hartree
nucrepener: 1712.35639767 hartree
electener: -3754.54413809 hartree
oneelecener: -6219.96374134 hartree
twoeener: 2465.41960325 hartree
cpcmener: -0.02162204 hartree
kineticenergy: 2036.95997757 hartree
xcener: -124.859529944341 hartree
chargesum: 0.0000000
charge: -0.175321 -0.152703 -0.459123 0.633734 -0.346379 -0.353821 0.205806 -0.321690 -0.298439 -0.336719 -0.145522 0.033265 0.046856 -0.242347 -0.238255 0.102328 0.095311 0.099703 0.107351 0.104107 0.100308 0.108167 0.104744 0.089890 0.158566 0.157949 0.113779 0.099145 0.108565 0.085688 0.105867 0.074423 0.076262 0.073858 0.089901 0.094747
qa: -0.1753 -0.1527 -0.4591 0.6337 -0.3464 -0.3538 0.2058 -0.3217 -0.2984 -0.3367 -0.1455 0.0333 0.0469 -0.2423 -0.2383 0.1023 0.0953 0.0997 0.1074 0.1041 0.1003 0.1082 0.1047 0.0899 0.1586 0.1579 0.1138 0.0991 0.1086 0.0857 0.1059 0.0744 0.0763 0.0739 0.0899 0.0947
va: 2.2390 2.2891 2.0005 5.4479 2.0913 2.0821 3.8289 3.9392 3.8790 3.9392 4.0035 3.8265 3.8372 3.8824 3.9533 1.0037 1.0139 1.0029 1.0052 1.0091 1.0038 1.0066 1.0045 0.9973 1.0135 1.0048 0.9924 1.0153 0.9908 1.0109 1.0135 1.0195 1.0256 1.0196 1.0038 1.0071
dispcorr: -0.018402708 hartree
energy: -2042.206143126009
dipole: 19.05139 -16.95986 2.09153 -5.52561 5.86060 0.33498 3.15818 -2.75403 0.40415
magnitude: 2.15640 au
magnitude: 5.48114 debye
