program: Orca
programVersion: 5.0.2
elementType: S S S P O O C C C C C C C C C H H H H H H H H H H H H H H H H H H H H H
charge: 0
multiplicity: 1
keywords: wb97x-d3
keywords: def2-TZVPP
keywords: def2/J RIJCOSX
keywords: DEFGRID2
keywords: scfconv7
keywords: smallprint printgap noloewdin
keywords: NOSOSCF
formula: C9H21O2PS3
InChI: InChI=1/C9H21O2PS3/c1-6-10-12(13,11-7-2)15-8-14-9(3,4)5/h6-8H2,1-5H3
36 atoms
S  1.997244 -0.170775 1.215726
S  0.006534 -0.701347 -1.084003
S  -2.741457 0.943411 -1.69772
P  -1.62644 0.288282 -0.270577
O  -2.303761 -0.680604 0.807697
O  -1.046507 1.335906 0.789479
C  3.600919 -0.473175 0.356409
C  4.153165 -1.838431 0.741797
C  3.453554 -0.358734 -1.153568
C  4.515931 0.630308 0.878592
C  0.870059 -1.313667 0.416714
C  -3.355197 -1.602952 0.45655
C  -0.329896 2.506721 0.34239
C  -2.87296 -2.776343 -0.361531
C  -1.226589 3.719145 0.37069
H  4.307813 -1.916943 1.817633
H  3.493499 -2.651123 0.434328
H  5.114863 -2.002789 0.250061
H  3.00463 0.589783 -1.446999
H  2.853072 -1.167332 -1.572655
H  4.44023 -0.423985 -1.618602
H  4.614346 0.598291 1.965103
H  5.513799 0.504814 0.45423
H  4.155085 1.620371 0.596985
H  1.389389 -2.21886 0.101928
H  0.126886 -1.627059 1.147865
H  -3.752575 -1.93779 1.412829
H  -4.146554 -1.062659 -0.066111
H  0.510492 2.61595 1.024913
H  0.085185 2.346058 -0.655752
H  -2.041839 -3.291247 0.120337
H  -3.6929 -3.487718 -0.462182
H  -2.566202 -2.483574 -1.364934
H  -2.042185 3.631189 -0.346188
H  -1.649008 3.878253 1.362831
H  -0.642996 4.60267 0.111089
elementType: S P O C H
totalener: -2042.18835574 hartree
nucrepener: 1711.46860708 hartree
electener: -3753.65696282 hartree
oneelecener: -6218.17393791 hartree
twoeener: 2464.51697508 hartree
cpcmener: -0.02104474 hartree
kineticenergy: 2036.97438552 hartree
xcener: -124.861512159001 hartree
chargesum: 0.0000000
charge: -0.170418 -0.147956 -0.457313 0.632292 -0.351597 -0.350852 0.204096 -0.324761 -0.331597 -0.294288 -0.143983 0.040265 0.049382 -0.253644 -0.243674 0.095515 0.102056 0.099867 0.102006 0.088386 0.107558 0.103875 0.099315 0.104681 0.156339 0.156021 0.111971 0.095258 0.097716 0.085852 0.093085 0.106093 0.078342 0.075365 0.089430 0.095315
qa: -0.1704 -0.1480 -0.4573 0.6323 -0.3516 -0.3509 0.2041 -0.3248 -0.3316 -0.2943 -0.1440 0.0403 0.0494 -0.2536 -0.2437 0.0955 0.1021 0.0999 0.1020 0.0884 0.1076 0.1039 0.0993 0.1047 0.1563 0.1560 0.1120 0.0953 0.0977 0.0859 0.0931 0.1061 0.0783 0.0754 0.0894 0.0953
va: 2.2472 2.2958 2.0046 5.4488 2.0881 2.0803 3.8337 3.9415 3.9325 3.8751 4.0040 3.8327 3.8413 3.8994 3.9740 1.0136 1.0038 1.0026 1.0111 0.9977 1.0066 1.0088 1.0040 1.0106 1.0046 1.0204 0.9921 1.0143 1.0014 1.0078 1.0040 1.0112 1.0161 1.0199 1.0041 1.0065
dispcorr: -0.018016742 hartree
energy: -2042.206372483630
dipole: 19.48953 -17.82221 1.66732 -3.87288 2.65955 -1.21332 3.70973 -3.11430 0.59542
magnitude: 2.14631 au
magnitude: 5.45549 debye
