program: Orca
programVersion: 5.0.2
elementType: S S S P O O C C C C C C C C C H H H H H H H H H H H H H H H H H H H H H
charge: 0
multiplicity: 1
keywords: wb97x-d3
keywords: def2-TZVPP
keywords: def2/J RIJCOSX
keywords: DEFGRID2
keywords: scfconv7
keywords: smallprint printgap noloewdin
keywords: NOSOSCF
formula: C9H21O2PS3
InChI: InChI=1/C9H21O2PS3/c1-6-10-12(13,11-7-2)15-8-14-9(3,4)5/h6-8H2,1-5H3
36 atoms
S  2.688606 -1.579503 0.409773
S  -0.132832 -0.703615 0.847778
S  -0.898771 0.637372 -2.201474
P  -1.535225 0.141202 -0.453139
O  -2.792582 -0.832795 -0.553702
O  -2.109542 1.316834 0.472834
C  3.479404 -0.032511 -0.215661
C  2.656392 1.200415 0.127425
C  4.820694 0.00677 0.510374
C  3.700105 -0.128506 -1.718555
C  1.038514 -1.532433 -0.292891
C  -3.469499 -1.38971 0.596248
C  -1.31467 2.480615 0.780829
C  -4.757443 -0.659584 0.879484
C  -2.220291 3.527189 1.374457
H  3.215978 2.093763 -0.161551
H  1.707649 1.225684 -0.410806
H  2.445235 1.264917 1.194868
H  5.424631 -0.877775 0.299033
H  4.694398 0.08562 1.59114
H  5.386993 0.878351 0.176961
H  4.304914 -0.996855 -1.980123
H  2.759934 -0.189565 -2.268912
H  4.221544 0.764728 -2.071798
H  1.023411 -1.024445 -1.258178
H  0.710333 -2.559387 -0.444407
H  -3.660733 -2.431577 0.343243
H  -2.814115 -1.383291 1.469886
H  -0.52649 2.19965 1.482469
H  -0.839855 2.849497 -0.13098
H  -5.277449 -1.169565 1.690974
H  -4.586018 0.370025 1.190358
H  -5.416888 -0.6589 0.011716
H  -2.985605 3.842963 0.666088
H  -2.706339 3.170507 2.282463
H  -1.624937 4.401735 1.63627
elementType: S P O C H
totalener: -2042.18768073 hartree
nucrepener: 1691.40425286 hartree
electener: -3733.59193359 hartree
oneelecener: -6177.83360461 hartree
twoeener: 2444.24167102 hartree
cpcmener: -0.01934005 hartree
kineticenergy: 2036.96563533 hartree
xcener: -124.857146417427 hartree
chargesum: -0.0000000
charge: -0.173798 -0.178098 -0.447760 0.644673 -0.359028 -0.337716 0.194200 -0.305285 -0.290892 -0.320350 -0.100993 0.045278 0.049022 -0.244953 -0.251505 0.107320 0.056349 0.098929 0.104824 0.104217 0.099373 0.097068 0.098805 0.101660 0.114511 0.165906 0.108008 0.093520 0.096139 0.093646 0.095298 0.081219 0.088208 0.089637 0.090004 0.092562
qa: -0.1738 -0.1781 -0.4478 0.6447 -0.3590 -0.3377 0.1942 -0.3053 -0.2909 -0.3204 -0.1010 0.0453 0.0490 -0.2450 -0.2515 0.1073 0.0563 0.0989 0.1048 0.1042 0.0994 0.0971 0.0988 0.1017 0.1145 0.1659 0.1080 0.0935 0.0961 0.0936 0.0953 0.0812 0.0882 0.0896 0.0900 0.0926
va: 2.2324 2.2910 2.0050 5.4418 2.1170 2.0892 3.8729 3.9110 3.8650 3.9477 3.9658 3.8538 3.8378 3.9351 3.9717 1.0094 1.0270 1.0144 1.0095 1.0118 1.0036 1.0142 1.0007 1.0025 1.0507 0.9978 0.9938 1.0051 0.9930 1.0003 1.0072 1.0136 1.0043 1.0054 1.0031 1.0061
dispcorr: -0.017658759 hartree
energy: -2042.205339488424
dipole: 7.67827 -7.61154 0.06673 10.20584 -9.72340 0.48244 6.43334 -5.00821 1.42513
magnitude: 1.50606 au
magnitude: 3.82810 debye
