program: Orca
programVersion: 5.0.2
elementType: S S S P O O C C C C C C C C C H H H H H H H H H H H H H H H H H H H H H
charge: 0
multiplicity: 1
keywords: wb97x-d3
keywords: def2-TZVPP
keywords: def2/J RIJCOSX
keywords: DEFGRID2
keywords: scfconv7
keywords: smallprint printgap noloewdin
keywords: NOSOSCF
formula: C9H21O2PS3
InChI: InChI=1/C9H21O2PS3/c1-6-10-12(13,11-7-2)15-8-14-9(3,4)5/h6-8H2,1-5H3
36 atoms
S  2.184262 0.241936 -0.820457
S  -0.178182 -1.685832 -0.261374
S  -1.36931 0.747675 -2.292256
P  -1.337674 0.026955 -0.505573
O  -2.769802 -0.499006 -0.021413
O  -0.822778 1.009768 0.648924
C  3.354543 -0.317292 0.489682
C  4.436695 -1.198958 -0.11959
C  3.964027 0.978815 1.016959
C  2.634473 -1.045123 1.615496
C  1.280079 -1.239924 -1.27531
C  -3.263904 -0.477066 1.335775
C  -0.722383 2.437495 0.489829
C  -2.561347 -1.454901 2.24534
C  -2.063038 3.119336 0.610222
H  5.000539 -0.666359 -0.88658
H  5.138309 -1.515718 0.656543
H  4.023474 -2.102954 -0.569437
H  4.455379 1.551078 0.227607
H  4.717482 0.74344 1.771477
H  3.211632 1.616918 1.483606
H  3.339916 -1.23357 2.429198
H  1.805823 -0.456907 2.011729
H  2.242857 -2.011802 1.298173
H  0.941158 -1.104457 -2.301629
H  1.920139 -2.122878 -1.25817
H  -3.210834 0.53888 1.729007
H  -4.316562 -0.737752 1.238818
H  -0.045828 2.759377 1.280039
H  -0.250376 2.663495 -0.467464
H  -2.585661 -2.467508 1.842006
H  -1.525401 -1.175927 2.438403
H  -3.079638 -1.468856 3.204651
H  -2.738574 2.826047 -0.194074
H  -2.541351 2.90233 1.565869
H  -1.921663 4.199067 0.546275
elementType: S P O C H
totalener: -2042.18387316 hartree
nucrepener: 1742.43720434 hartree
electener: -3784.62107750 hartree
oneelecener: -6280.47620017 hartree
twoeener: 2495.85512267 hartree
cpcmener: -0.02274449 hartree
kineticenergy: 2036.96046112 hartree
xcener: -124.859970787748 hartree
chargesum: -0.0000000
charge: -0.180237 -0.164618 -0.462327 0.642509 -0.370919 -0.342592 0.203033 -0.321556 -0.296057 -0.327518 -0.132886 0.037382 0.058733 -0.263405 -0.260298 0.094931 0.099540 0.100788 0.103785 0.099283 0.105556 0.106680 0.096864 0.089617 0.159261 0.155585 0.103722 0.109388 0.108547 0.085197 0.093350 0.081783 0.105177 0.084063 0.092070 0.105570
qa: -0.1802 -0.1646 -0.4623 0.6425 -0.3709 -0.3426 0.2030 -0.3216 -0.2961 -0.3275 -0.1329 0.0374 0.0587 -0.2634 -0.2603 0.0949 0.0995 0.1008 0.1038 0.0993 0.1056 0.1067 0.0969 0.0896 0.1593 0.1556 0.1037 0.1094 0.1085 0.0852 0.0934 0.0818 0.1052 0.0841 0.0921 0.1056
va: 2.2368 2.2887 1.9916 5.4133 2.0824 2.0369 3.8467 3.9396 3.8780 3.9342 3.9856 3.8699 3.8170 3.9003 3.9372 1.0133 1.0028 1.0047 1.0088 1.0043 1.0086 1.0068 1.0135 1.0012 1.0207 1.0030 0.9907 0.9902 0.9899 1.0184 1.0017 1.0103 1.0117 1.0175 1.0025 1.0094
dispcorr: -0.018688138 hartree
energy: -2042.202561301471
dipole: 13.43847 -12.62906 0.80941 2.63017 -2.73900 -0.10883 18.70035 -16.19903 2.50132
magnitude: 2.63127 au
magnitude: 6.68816 debye
