program: Orca
programVersion: 5.0.2
elementType: S S S P O O C C C C C C C C C H H H H H H H H H H H H H H H H H H H H H
charge: 0
multiplicity: 1
keywords: wb97x-d3
keywords: def2-TZVPP
keywords: def2/J RIJCOSX
keywords: DEFGRID2
keywords: scfconv7
keywords: smallprint printgap noloewdin
keywords: NOSOSCF
formula: C9H21O2PS3
InChI: InChI=1/C9H21O2PS3/c1-6-10-12(13,11-7-2)15-8-14-9(3,4)5/h6-8H2,1-5H3
36 atoms
S  2.044719 0.086384 -0.983305
S  -0.072092 -1.542855 0.5922
S  -1.614549 0.236731 -1.872276
P  -1.352819 -0.010565 0.023249
O  -2.662625 -0.369493 0.877945
O  -0.808618 1.241204 0.850384
C  3.438037 0.030289 0.22173
C  4.07534 1.411591 0.095643
C  2.943765 -0.184018 1.644439
C  4.43709 -1.047783 -0.173559
C  1.172198 -1.462946 -0.750471
C  -3.610824 -1.365199 0.447933
C  -1.268509 2.58377 0.571301
C  -4.98291 -0.95038 0.910789
C  -0.227318 3.350862 -0.202546
H  3.384992 2.202453 0.393889
H  4.948865 1.469007 0.747843
H  4.410672 1.615924 -0.922748
H  2.534737 -1.183481 1.791207
H  2.176231 0.539947 1.91782
H  3.780567 -0.070773 2.338088
H  4.819751 -0.887426 -1.181614
H  5.285559 -1.037483 0.515045
H  4.000946 -2.046971 -0.130709
H  0.664779 -1.685873 -1.687906
H  1.8568 -2.287164 -0.548052
H  -3.584683 -1.461369 -0.639658
H  -3.320685 -2.324743 0.879116
H  -2.218571 2.563069 0.03352
H  -1.452012 3.038149 1.544234
H  -5.703318 -1.717301 0.626733
H  -5.025757 -0.837911 1.994189
H  -5.291102 -0.012484 0.448745
H  0.72495 3.378948 0.327843
H  -0.063665 2.916665 -1.187975
H  -0.567834 4.378142 -0.336094
elementType: S P O C H
totalener: -2042.18684634 hartree
nucrepener: 1722.50041352 hartree
electener: -3764.68725986 hartree
oneelecener: -6240.97072429 hartree
twoeener: 2476.28346443 hartree
cpcmener: -0.01985323 hartree
kineticenergy: 2036.97976140 hartree
xcener: -124.860154479917 hartree
chargesum: -0.0000000
charge: -0.171595 -0.160125 -0.468892 0.672010 -0.366279 -0.346986 0.197859 -0.294487 -0.328425 -0.323641 -0.137634 0.033541 0.051846 -0.238962 -0.246891 0.105410 0.099963 0.104520 0.093497 0.094560 0.105788 0.096120 0.099597 0.101970 0.158299 0.156124 0.088600 0.102534 0.088916 0.108350 0.088872 0.088891 0.084974 0.082848 0.075629 0.103199
qa: -0.1716 -0.1601 -0.4689 0.6720 -0.3663 -0.3470 0.1979 -0.2945 -0.3284 -0.3236 -0.1376 0.0335 0.0518 -0.2390 -0.2469 0.1054 0.1000 0.1045 0.0935 0.0946 0.1058 0.0961 0.0996 0.1020 0.1583 0.1561 0.0886 0.1025 0.0889 0.1084 0.0889 0.0889 0.0850 0.0828 0.0756 0.1032
va: 2.2472 2.2950 1.9664 5.3976 2.0940 2.0792 3.8594 3.8720 3.9249 3.9339 3.9855 3.8513 3.8369 3.9577 3.9341 1.0072 1.0046 1.0095 1.0020 1.0193 1.0070 1.0139 1.0030 1.0034 1.0180 1.0034 1.0099 0.9950 1.0119 0.9967 1.0068 1.0038 1.0073 1.0037 1.0153 1.0113
dispcorr: -0.017701047 hartree
energy: -2042.204547385144
dipole: 11.98259 -11.53167 0.45092 5.58208 -5.92822 -0.34614 6.82584 -5.75832 1.06752
magnitude: 1.20944 au
magnitude: 3.07415 debye
