program: Orca
programVersion: 5.0.2
elementType: S S S P O O C C C C C C C C C H H H H H H H H H H H H H H H H H H H H H
charge: 0
multiplicity: 1
keywords: wb97x-d3
keywords: def2-TZVPP
keywords: def2/J RIJCOSX
keywords: DEFGRID2
keywords: scfconv7
keywords: smallprint printgap noloewdin
keywords: NOSOSCF
formula: C9H21O2PS3
InChI: InChI=1/C9H21O2PS3/c1-6-10-12(13,11-7-2)15-8-14-9(3,4)5/h6-8H2,1-5H3
36 atoms
S  2.119235 0.155937 -0.865961
S  -0.255951 -1.742474 -0.234005
S  -1.407692 0.683854 -2.296864
P  -1.368929 -0.000198 -0.495464
O  -2.800786 -0.490328 0.022311
O  -0.829182 0.996962 0.634247
C  3.239813 -0.312771 0.520681
C  3.89586 1.007496 0.916752
C  2.469388 -0.883184 1.702664
C  4.293219 -1.299541 0.037138
C  1.210829 -1.342561 -1.254565
C  -3.28337 -0.395508 1.380848
C  -0.559276 2.393648 0.408455
C  -2.569363 -1.319032 2.337318
C  -1.813909 3.226997 0.49306
H  4.615347 0.828956 1.718021
H  4.435712 1.461927 0.084135
H  3.162234 1.727749 1.282949
H  1.664451 -0.219928 2.020044
H  3.152204 -1.016541 2.545477
H  2.035761 -1.857577 1.479817
H  3.852537 -2.24185 -0.291272
H  4.87446 -0.889944 -0.788697
H  4.982291 -1.534319 0.851677
H  0.879161 -1.247142 -2.287727
H  1.846334 -2.226508 -1.197397
H  -3.231449 0.640781 1.716677
H  -4.335377 -0.665215 1.308132
H  0.151763 2.67098 1.185051
H  -0.066031 2.517257 -0.556037
H  -2.596907 -2.353033 1.993515
H  -1.531663 -1.029988 2.502282
H  -3.076713 -1.277518 3.301584
H  -1.551599 4.27912 0.376934
H  -2.51953 2.970683 -0.297587
H  -2.310409 3.111064 1.456722
elementType: S P O C H
totalener: -2042.18355059 hartree
nucrepener: 1749.51093000 hartree
electener: -3791.69448059 hartree
oneelecener: -6294.56113906 hartree
twoeener: 2502.86665847 hartree
cpcmener: -0.02219504 hartree
kineticenergy: 2036.97162591 hartree
xcener: -124.862926408561 hartree
chargesum: 0.0000000
charge: -0.178996 -0.166284 -0.462413 0.646744 -0.371883 -0.343828 0.202740 -0.295919 -0.335728 -0.322020 -0.132047 0.039739 0.062257 -0.265150 -0.256857 0.099688 0.104007 0.104972 0.097024 0.107585 0.095081 0.101875 0.096216 0.099663 0.157789 0.156701 0.101196 0.109410 0.106827 0.084360 0.092433 0.083413 0.105221 0.103773 0.082047 0.090362
qa: -0.1790 -0.1663 -0.4624 0.6467 -0.3719 -0.3438 0.2027 -0.2959 -0.3357 -0.3220 -0.1320 0.0397 0.0623 -0.2651 -0.2569 0.0997 0.1040 0.1050 0.0970 0.1076 0.0951 0.1019 0.0962 0.0997 0.1578 0.1567 0.1012 0.1094 0.1068 0.0844 0.0924 0.0834 0.1052 0.1038 0.0820 0.0904
va: 2.2353 2.2840 1.9902 5.4110 2.0844 2.0354 3.8476 3.8762 3.9328 3.9329 3.9801 3.8698 3.8130 3.9004 3.9480 1.0047 1.0092 1.0082 1.0120 1.0069 1.0031 1.0039 1.0138 1.0030 1.0206 1.0020 0.9924 0.9904 0.9892 1.0182 1.0013 1.0092 1.0120 1.0090 1.0178 1.0037
dispcorr: -0.019089106 hartree
energy: -2042.202639698405
dipole: 13.95858 -13.02918 0.92940 3.73308 -3.74235 -0.00927 18.89727 -16.38519 2.51208
magnitude: 2.67851 au
magnitude: 6.80823 debye
