program: Orca
programVersion: 5.0.2
elementType: S S S P O O C C C C C C C C C H H H H H H H H H H H H H H H H H H H H H
charge: 0
multiplicity: 1
keywords: wb97x-d3
keywords: def2-TZVPP
keywords: def2/J RIJCOSX
keywords: DEFGRID2
keywords: scfconv7
keywords: smallprint printgap noloewdin
keywords: NOSOSCF
formula: C9H21O2PS3
InChI: InChI=1/C9H21O2PS3/c1-6-10-12(13,11-7-2)15-8-14-9(3,4)5/h6-8H2,1-5H3
36 atoms
S  2.7073 -1.39404 0.891543
S  0.024039 -0.132603 1.383495
S  -1.064044 0.336413 -1.816991
P  -1.533175 0.226041 0.055049
O  -2.581884 -0.915808 0.441992
O  -2.210816 1.527005 0.696726
C  3.422926 -0.311752 -0.421747
C  2.766219 1.060578 -0.433657
C  4.892865 -0.189791 -0.031462
C  3.299559 -0.982332 -1.782724
C  0.956188 -1.448177 0.505563
C  -3.802381 -1.103584 -0.312375
C  -1.948553 2.865112 0.225891
C  -4.004048 -2.576552 -0.547096
C  -0.594639 3.378114 0.648727
H  2.824448 1.544419 0.540947
H  3.27881 1.697388 -1.158946
H  1.717804 1.012399 -0.729213
H  5.412437 0.419909 -0.772984
H  5.388026 -1.161651 0.000993
H  5.016967 0.290994 0.939744
H  2.260313 -1.114057 -2.086726
H  3.778286 -0.360048 -2.542578
H  3.783656 -1.958634 -1.793205
H  0.782259 -1.356989 -0.567039
H  0.573791 -2.414073 0.82814
H  -4.616672 -0.675667 0.271798
H  -3.749057 -0.567784 -1.261833
H  -2.056741 2.892395 -0.859395
H  -2.744355 3.46921 0.657338
H  -4.942883 -2.729925 -1.078298
H  -3.201731 -2.994065 -1.15471
H  -4.057656 -3.12881 0.390685
H  -0.509934 4.423992 0.352356
H  -0.463546 3.325875 1.729041
H  0.220348 2.833974 0.170943
elementType: S P O C H
totalener: -2042.18708873 hartree
nucrepener: 1699.90074995 hartree
electener: -3742.08783868 hartree
oneelecener: -6195.14531845 hartree
twoeener: 2453.05747977 hartree
cpcmener: -0.01736136 hartree
kineticenergy: 2036.97811537 hartree
xcener: -124.860048983856 hartree
chargesum: 0.0000000
charge: -0.172685 -0.150830 -0.465227 0.666093 -0.356594 -0.362407 0.197501 -0.299230 -0.291612 -0.320144 -0.109296 0.035908 0.042368 -0.232876 -0.242939 0.099921 0.107132 0.043673 0.099431 0.104468 0.104463 0.098320 0.101504 0.097856 0.112325 0.165758 0.106991 0.085512 0.094466 0.110315 0.090044 0.082485 0.089125 0.103685 0.092795 0.071700
qa: -0.1727 -0.1508 -0.4652 0.6661 -0.3566 -0.3624 0.1975 -0.2992 -0.2916 -0.3201 -0.1093 0.0359 0.0424 -0.2329 -0.2429 0.0999 0.1071 0.0437 0.0994 0.1045 0.1045 0.0983 0.1015 0.0979 0.1123 0.1658 0.1070 0.0855 0.0945 0.1103 0.0900 0.0825 0.0891 0.1037 0.0928 0.0717
va: 2.2328 2.2977 1.9707 5.4028 2.1007 2.0910 3.8770 3.9051 3.8642 3.9468 3.9658 3.8469 3.8511 3.9442 3.9110 1.0128 1.0093 1.0350 1.0035 1.0104 1.0115 1.0009 1.0026 1.0143 1.0529 1.0025 0.9975 1.0129 1.0124 0.9917 1.0079 1.0086 1.0042 1.0135 1.0040 0.9978
dispcorr: -0.017979871 hartree
energy: -2042.205068603532
dipole: 9.54020 -10.06611 -0.52592 3.70099 -3.08438 0.61660 -7.70604 7.23130 -0.47473
magnitude: 0.93923 au
magnitude: 2.38734 debye
