program: Orca
programVersion: 5.0.2
elementType: S S S P O O C C C C C C C C C H H H H H H H H H H H H H H H H H H H H H
charge: 0
multiplicity: 1
keywords: wb97x-d3
keywords: def2-TZVPP
keywords: def2/J RIJCOSX
keywords: DEFGRID2
keywords: scfconv7
keywords: smallprint printgap noloewdin
keywords: NOSOSCF
formula: C9H21O2PS3
InChI: InChI=1/C9H21O2PS3/c1-6-10-12(13,11-7-2)15-8-14-9(3,4)5/h6-8H2,1-5H3
36 atoms
S  2.225539 0.001705 -0.905887
S  -0.124706 -0.887659 0.867679
S  -1.158909 0.54103 -2.055166
P  -1.603233 0.116039 -0.23331
O  -2.912856 -0.795155 -0.133651
O  -2.002868 1.333721 0.728211
C  3.649117 -0.22306 0.246021
C  4.415114 -1.491161 -0.10444
C  4.523354 1.002411 -0.001226
C  3.192937 -0.24877 1.697566
C  1.092394 -1.30714 -0.434696
C  -3.496555 -1.187177 1.128601
C  -1.397741 2.639008 0.629239
C  -4.378607 -2.384556 0.892556
C  0.012926 2.685337 1.163871
H  4.786628 -1.461429 -1.129279
H  5.272752 -1.603278 0.563741
H  3.800473 -2.386364 0.006969
H  4.006922 1.926329 0.262555
H  4.841904 1.073882 -1.042757
H  5.423172 0.93594 0.61349
H  2.601227 0.630889 1.951793
H  2.603192 -1.136421 1.930673
H  4.068276 -0.267951 2.351508
H  0.55819 -1.633218 -1.324383
H  1.630999 -2.173086 -0.049801
H  -2.71195 -1.433415 1.849324
H  -4.071272 -0.350076 1.526657
H  -1.432197 2.968876 -0.410871
H  -2.052453 3.288976 1.207333
H  -5.177249 -2.163264 0.184297
H  -3.807212 -3.236178 0.523965
H  -4.841789 -2.674033 1.835995
H  0.346377 3.723817 1.162936
H  0.068631 2.317627 2.1883
H  0.707687 2.111645 0.54963
elementType: S P O C H
totalener: -2042.18505806 hartree
nucrepener: 1709.46086979 hartree
electener: -3751.64592786 hartree
oneelecener: -6214.51383499 hartree
twoeener: 2462.86790714 hartree
cpcmener: -0.02186803 hartree
kineticenergy: 2036.96385960 hartree
xcener: -124.859056050114 hartree
chargesum: 0.0000000
charge: -0.180179 -0.183288 -0.442873 0.650623 -0.352042 -0.346115 0.215767 -0.320424 -0.299129 -0.332554 -0.122209 0.025039 0.033297 -0.238928 -0.224936 0.094690 0.099837 0.101256 0.105457 0.103619 0.099739 0.103370 0.086843 0.108138 0.150960 0.157375 0.101778 0.102231 0.090899 0.107727 0.089344 0.086554 0.088750 0.101514 0.088145 0.049728
qa: -0.1802 -0.1833 -0.4429 0.6506 -0.3520 -0.3461 0.2158 -0.3204 -0.2991 -0.3326 -0.1222 0.0250 0.0333 -0.2389 -0.2249 0.0947 0.0998 0.1013 0.1055 0.1036 0.0997 0.1034 0.0868 0.1081 0.1510 0.1574 0.1018 0.1022 0.0909 0.1077 0.0893 0.0866 0.0887 0.1015 0.0881 0.0497
va: 2.2431 2.2720 2.0127 5.4147 2.1178 2.0822 3.8230 3.9411 3.8866 3.9410 3.9737 3.8694 3.8727 3.9511 3.8678 1.0141 1.0030 1.0035 1.0060 1.0088 1.0038 1.0027 0.9993 1.0071 1.0255 1.0062 0.9913 0.9953 1.0108 0.9902 1.0046 1.0064 1.0061 1.0146 1.0070 1.0421
dispcorr: -0.017510610 hartree
energy: -2042.202568673645
dipole: 16.27137 -15.51614 0.75522 -1.10293 0.67363 -0.42930 13.29162 -10.93582 2.35580
magnitude: 2.51087 au
magnitude: 6.38212 debye
