program: Gaussian 09
title: 000066812
version: EM64L-G09RevD.01
frameworkgroup: C1[X(C7H10N2O3S)]
method: RPBEPBE
basis: SDD
operation: Freq
keyword: #p
keyword: freq=noraman
keyword: PBEPBE/SDD
title: #p freq=noraman PBEPBE/SDD
converged: YES YES NO NO
title: Mulliken charges:
elementType: S O O O N N C C C C C C C H H H H H H H H H H
charge: 0.975768 -0.570058 -0.514088 -0.514253 -0.713105 -0.712810 0.086960 0.020890 0.441188 0.440440 -0.504856 -0.503165 -0.819718 0.274899 0.274352 0.220904 0.221854 0.245423 0.320617 0.316337 0.315012 0.320624 0.376785
chargesum: 0.00000
title: Mulliken charges with hydrogens summed into heavy atoms:
elementType: S O O O N N C C C C C C C
charge: 0.975768 -0.193273 -0.514088 -0.514253 -0.076151 -0.077175 0.086960 0.020890 0.441188 0.440440 -0.229957 -0.228814 -0.131537
polarizability: 1.71661687e+02 -4.96783867e-02 1.46747869e+02 1.38677133e-01 1.75504532e-02 7.55049261e+01
1716.lowfreq: -10.4621 -7.9073 -6.3361 -0.0014 -0.0011 -0.0004 28.7710 60.7036 77.4553
frequency: 28.6141 60.5315 77.4516 118.8520 131.4997 148.2788 206.9083 220.7734 225.0386 252.5408 277.4497 302.9589 326.8328 327.2469 336.9989 367.2001 396.3666 413.1217 415.7376 416.5722 514.0558 519.4175 534.1429 535.3930 594.9627 597.6948 696.0580 733.0911 814.8662 820.4034 849.6189 855.0298 930.9073 967.5227 1016.6092 1033.5277 1033.9098 1050.9481 1107.8472 1166.7999 1201.3978 1249.4994 1352.9891 1399.2607 1404.8760 1453.9862 1480.5946 1497.1903 1506.8251 1585.6191 1626.0509 1641.3537 1648.3438 2957.1985 3036.3139 3057.2977 3157.8966 3160.5145 3478.3290 3575.7603 3576.6289 3714.8904 3715.1667
redmass: 5.9210 1.1508 4.6446 6.7408 3.7531 1.3917 6.3899 3.1642 7.8296 3.7719 2.2140 1.2731 3.0347 8.9776 4.2705 1.6449 1.7443 1.1348 9.9767 1.2506 7.4904 3.9056 3.6395 8.2386 6.6548 3.4652 3.8260 2.0420 9.0111 1.6397 5.0437 2.5318 2.0409 7.5849 1.7298 1.5090 1.4357 1.1637 1.4660 2.6773 3.8992 1.3037 2.7625 1.3098 5.7716 1.6604 2.0363 1.1126 3.9188 5.4586 3.6688 1.3881 1.1732 1.0393 1.0956 1.0969 1.0920 1.0929 1.0660 1.0453 1.0455 1.1034 1.1033
irintensity: 2.0034 0.2405 0.6101 0.0021 6.4313 62.0593 6.9729 1.8798 7.3933 33.1634 11.3496 1.6395 103.9410 28.2654 5.7225 292.0465 0.0870 7.6117 70.6293 151.4335 24.9221 0.5413 3.2666 107.1464 86.3968 0.2108 8.3061 1.9939 59.6369 1.5140 18.4573 84.7813 10.2210 80.8788 0.6823 3.2614 0.0978 74.5250 42.2434 54.8448 8.8525 7.8917 38.7763 1.8936 28.4645 44.0216 79.3349 14.8868 37.4002 50.9709 65.3972 465.6058 75.1623 48.6979 23.6887 15.7725 0.0728 11.9709 35.2896 104.6973 26.4466 19.4558 28.6870
temp: 298.150 k
press: 1.00000 atm
elementType: 16 8 8 8 7 7 6 6 6 6 6 6 6 1 1 1 1 1 1 1 1 1 1
symmnumber: 1
zpe: 442030.7 jmol-1
zpe.correction: 0.168361 hartree
zpe.thermalcorrener: 0.183315 hartree
zpe.thermalcorrenthalpy: 0.184259 hartree
zpe.thermalcorrgfe: 0.126593 hartree
zpe.sumelectzpe: -1004.834563 hartree
zpe.sumelectthermal: -1004.819608 hartree
zpe.sumelectthermalent: -1004.818664 hartree
zpe.sumelectthermalfe: -1004.876330 hartree
dipole: -7.3118 -0.0094 1.0657
dipole: 7.3890
quadrupole: -73.0629 -70.0517 -92.0326
quadrupole: -0.0854 9.5267 -0.0081
quadrupole: 5.3195 8.3307 -13.6502 -0.0854 9.5267 -0.0081
hfenergy: -1005.0029233 hartree
pointgroup: C01 [X(C7H10N2O3S1)]
dipole: -2.8868138 0.0439187 0.3397973 debye
dipolederiv: 2.0791573 -0.0179185 0.1023825 -0.0214683 1.2062954 -0.009849 0.236106 -0.0120964 1.6293908 -0.5429445 0.0055664 -0.2496511 0.0075109 -0.5431271 0.014147 -0.3387658 0.0158559 -1.0027337 -0.7382189 0.071796 0.0250542 0.0931624 -0.5882456 -0.1218688 0.0004534 -0.037937 -0.5212207 -0.7434544 -0.0676935 0.0263576 -0.0869384 -0.5893308 0.117269 -0.0022047 0.0343123 -0.5142843 -0.4968498 0.5621056 0.0494152 0.5486085 -1.1692927 0.0130196 0.0646456 -0.0186087 -0.7026459 -0.5369432 -0.5854935 0.0335204 -0.5740828 -1.1299924 -0.0278742 0.0504414 0.0044882 -0.70277 0.2373953 -0.0167529 -0.0127475 -0.0176755 -0.6460632 -0.0068794 0.0170472 -0.0070211 -0.1682338 -0.0922109 0.0103367 0.0183875 0.007212 0.4669314 0.0075919 0.1788301 0.0045709 -0.0847489 0.5008516 -0.6344755 0.0042651 -0.484508 1.2567679 -0.0197489 -0.018247 -0.0171094 0.1602701 0.5412604 0.6594256 0.0242543 0.5103944 1.2151833 0.051507 -0.003181 0.0499868 0.1629542 -0.4877192 0.4538553 -0.0127249 -0.2806172 -0.3947196 -0.0055957 -0.0239015 -0.0105995 -0.2276757 -0.493819 -0.4504368 -0.026489 0.283347 -0.3883432 0.0014175 -0.0152451 0.0065154 -0.2265326 -0.0787872 0.0028296 0.0197014 0.0048712 0.0362437 -0.001696 -0.031062 -0.0013857 0.1037334 0.1095432 -0.0418286 0.0105118 -0.0255099 0.0261881 -0.0011023 0.0022851 0.019502 0.1794622 0.1108476 0.0383769 0.011709 0.0228507 0.0239659 -0.0039941 0.0026629 -0.0246828 0.1783445 0.0318982 -0.0303557 0.0146356 -0.1456721 -0.0614905 0.1054378 0.0524527 0.0634139 0.0590949 0.0360723 0.0258069 0.0121531 0.1376902 -0.0559911 -0.1136395 0.0568099 -0.0716899 0.0475459 -0.0675104 0.0056501 -0.0689388 0.0085774 0.1107463 0.0085666 -0.128582 0.008681 -0.0846485 0.1276869 -0.0310582 -0.0144736 -0.0435472 0.2360357 0.0006133 -0.0069524 0.006262 0.3707482 0.1489469 -0.0434262 -0.0229071 -0.011126 0.2080266 -0.0085074 -0.0332626 0.0000465 0.3584947 0.1508365 0.0455564 -0.0222023 0.0141851 0.2062106 0.0050906 -0.0348183 -0.0040639 0.3588881 0.1303918 0.0354577 -0.0140885 0.0475264 0.2336599 -0.0043099 -0.0061051 -0.0105875 0.3703105 0.0735698 0.0026762 0.0918751 0.0052092 0.3403415 0.0004049 -0.0194069 0.0021472 0.2562564 unknown
polarizability: 171.5694641|-0.5453359|146.7430098|2.804274|1.0323291|75.602008 unknown
InChI: InChI=1S/C7H10N2O3S/c1-4-6(8)2-5(3-7(4)9)13(10,11)12/h2-3,10H,8-9H2,1H3
charge 0 multiplicity 1
23 atoms
S  2.531993 -0.090826 -0.047468
O  2.765058 -0.135602 1.801204
O  3.079993 -1.48939 -0.651194
O  3.12915 1.313836 -0.589138
N  -2.02655 2.447281 -0.032894
N  -2.113899 -2.465536 -0.106987
C  -2.118518 -0.008781 -0.008508
C  0.665718 -0.058157 -0.03118
C  -1.374655 1.213151 -0.025024
C  -1.419316 -1.255675 -0.062139
C  0.050851 1.194985 -0.024645
C  0.00616 -1.288029 -0.062224
C  -3.634469 0.020107 0.062789
H  0.641622 2.115545 -0.042416
H  0.563238 -2.228377 -0.109056
H  -4.034853 -0.867875 0.585543
H  -3.996329 0.889503 0.642545
H  -4.111061 0.062891 -0.937751
H  -1.486662 3.307139 -0.006348
H  -3.032326 2.51871 -0.141794
H  -3.120951 -2.49863 -0.221985
H  -1.604177 -3.34399 -0.105678
H  3.752484 -0.156378 1.968348
