program: Orca
programVersion: 5.0.2
elementType: S S S P O O C C C C C C C C C H H H H H H H H H H H H H H H H H H H H H
charge: 0
multiplicity: 1
keywords: wb97x-d3
keywords: def2-TZVPP
keywords: def2/J RIJCOSX
keywords: DEFGRID2
keywords: scfconv7
keywords: smallprint printgap noloewdin
keywords: NOSOSCF
formula: C9H21O2PS3
InChI: InChI=1/C9H21O2PS3/c1-6-10-12(13,11-7-2)15-8-14-9(3,4)5/h6-8H2,1-5H3
36 atoms
S  1.808293 -1.247976 -1.009631
S  0.901405 1.57164 -0.060744
S  -1.710313 0.235457 -1.802311
P  -1.015881 0.753194 -0.078504
O  -1.033904 -0.397351 1.037201
O  -1.711758 1.981812 0.67345
C  3.046789 -1.45781 0.347156
C  3.508261 -2.905345 0.198814
C  4.225425 -0.514347 0.171866
C  2.391873 -1.263543 1.708914
C  1.702558 0.516878 -1.317861
C  -1.399081 -1.767749 0.783283
C  -3.131414 1.966477 0.947453
C  -2.879004 -1.987681 0.971963
C  -3.869675 2.848522 -0.026864
H  4.20134 -3.149329 1.006485
H  2.674712 -3.607672 0.261279
H  4.02339 -3.070795 -0.74796
H  4.672792 -0.600527 -0.81903
H  4.994125 -0.760964 0.907629
H  3.950787 0.528304 0.33633
H  3.125698 -1.446535 2.497993
H  2.011078 -0.251378 1.836582
H  1.566071 -1.960664 1.854705
H  2.685021 0.961586 -1.473544
H  1.150455 0.620853 -2.252185
H  -1.080681 -2.058988 -0.2178
H  -0.821475 -2.353324 1.497584
H  -3.521958 0.946501 0.923187
H  -3.238491 2.330762 1.968429
H  -3.205824 -1.696606 1.970321
H  -3.463204 -1.434439 0.236421
H  -3.100444 -3.047977 0.844098
H  -3.490135 3.870225 -0.007153
H  -3.796327 2.467342 -1.04499
H  -4.924525 2.878322 0.247289
elementType: S P O C H
totalener: -2042.18539512 hartree
nucrepener: 1736.60385091 hartree
electener: -3778.78924603 hartree
oneelecener: -6268.84018623 hartree
twoeener: 2490.05094020 hartree
cpcmener: -0.01921072 hartree
kineticenergy: 2036.97562130 hartree
xcener: -124.862272146872 hartree
chargesum: 0.0000000
charge: -0.176966 -0.159670 -0.460704 0.660669 -0.356298 -0.359976 0.204349 -0.294267 -0.325010 -0.348164 -0.148541 0.071496 0.037362 -0.264399 -0.240343 0.098478 0.103557 0.101292 0.104247 0.104105 0.092656 0.109719 0.095300 0.099207 0.159276 0.162802 0.083573 0.108832 0.094323 0.107859 0.093036 0.078011 0.104376 0.090537 0.074686 0.094590
qa: -0.1770 -0.1597 -0.4607 0.6607 -0.3563 -0.3600 0.2043 -0.2943 -0.3250 -0.3482 -0.1485 0.0715 0.0374 -0.2644 -0.2403 0.0985 0.1036 0.1013 0.1042 0.1041 0.0927 0.1097 0.0953 0.0992 0.1593 0.1628 0.0836 0.1088 0.0943 0.1079 0.0930 0.0780 0.1044 0.0905 0.0747 0.0946
va: 2.2433 2.2976 1.9692 5.4023 2.0527 2.0954 3.8387 3.8863 3.9290 3.9284 3.9908 3.7851 3.8869 3.9651 3.9306 1.0045 1.0079 1.0140 1.0089 1.0039 0.9992 1.0077 1.0245 1.0057 0.9937 1.0178 1.0202 0.9896 0.9882 0.9950 1.0025 1.0132 1.0089 1.0043 1.0200 1.0080
dispcorr: -0.018931347 hartree
energy: -2042.204326466541
dipole: 4.69934 -4.36378 0.33556 -10.88689 10.26785 -0.61904 10.16387 -8.81824 1.34563
magnitude: 1.51873 au
magnitude: 3.86030 debye
