program: Gaussian 09
title: 000066806
version: EM64L-G09RevD.01
frameworkgroup: C1[X(C10H15NO2)]
method: RPBEPBE
basis: SDD
operation: Freq
keyword: #p
keyword: freq=noraman
keyword: PBEPBE/SDD
title: #p freq=noraman PBEPBE/SDD
converged: YES YES NO NO
title: Mulliken charges:
elementType: O O N C C C C C C C C C C H H H H H H H H H H H H H H H
charge: -0.310771 -0.278555 -0.691184 0.245775 0.348116 0.291273 -0.499905 -0.364324 -0.382637 -0.228122 -0.235236 -0.692122 -0.688355 0.260323 0.238487 0.213081 0.209517 0.209492 0.201078 0.201514 0.209323 0.228765 0.228828 0.203217 0.229263 0.229340 0.328603 0.295214
chargesum: 0.00000
title: Mulliken charges with hydrogens summed into heavy atoms:
elementType: O O N C C C C C C C C C C
charge: -0.310771 -0.278555 -0.067367 0.245775 0.348116 0.291273 -0.239581 -0.125837 -0.169556 0.190886 0.167356 -0.025206 -0.026535
polarizability: 1.80877650e+02 -3.90806443e+00 1.35691915e+02 1.17957355e-01 2.50730819e-02 7.07722906e+01
1716.lowfreq: -14.9221 -0.0009 -0.0008 -0.0004 6.3318 6.7534 47.7519 60.3116 96.2722
frequency: 47.4120 60.0922 96.2702 100.3226 105.5206 151.3604 160.3863 228.0483 240.9187 248.1824 279.2201 284.0179 300.7858 327.7033 365.3401 383.7932 424.3572 453.8445 497.2640 554.2307 592.6076 598.8284 713.0970 716.7319 778.3688 783.6167 819.1758 827.1360 844.2720 848.5662 887.4811 896.6865 969.2244 1022.1177 1040.8304 1047.4643 1114.7974 1116.4256 1131.6890 1137.4282 1139.1807 1161.1655 1224.5584 1257.1614 1262.2635 1276.2470 1318.1646 1364.2074 1372.2330 1392.3502 1396.9920 1406.5444 1438.1689 1459.6514 1462.1254 1477.5512 1478.9234 1489.3817 1492.3711 1523.3526 1595.9403 1604.4269 1642.2710 2940.8908 2954.8356 2993.6153 2994.4945 2995.0874 3011.2370 3091.0567 3092.0249 3101.6747 3101.9084 3124.9209 3166.4219 3172.4257 3572.7504 3721.4466
redmass: 3.6582 3.0701 3.4031 1.7555 1.8060 5.4105 3.4027 1.9390 1.1896 1.6660 3.6804 1.2427 3.4629 3.3190 6.9353 4.4841 1.3788 1.7819 3.8752 4.4747 6.0947 3.5080 5.3374 3.1452 1.5092 4.2166 1.1821 1.1040 3.6997 1.4029 1.3558 2.8488 2.7005 1.6486 2.4019 3.1400 2.1624 2.1788 2.3999 1.4396 1.4487 1.4019 3.5840 1.1437 1.1354 1.5696 2.6523 1.3089 1.3959 1.3357 1.3141 3.4404 4.4854 1.0410 1.0406 1.0689 1.0536 1.1124 1.0935 3.1596 7.5321 1.2933 4.5446 1.0550 1.0556 1.0359 1.0360 1.1070 1.1074 1.0989 1.0988 1.1014 1.1012 1.0889 1.0934 1.0911 1.0440 1.1047
irintensity: 2.6712 2.8413 1.1606 4.3294 0.9066 0.1130 2.2509 14.6454 0.0405 7.2946 0.2360 234.0221 0.7440 3.9838 6.0015 5.5243 45.0602 13.4928 3.7402 3.7681 2.4618 13.1801 15.3602 0.1201 47.9183 9.7830 26.2781 0.0032 1.2998 20.1009 1.6963 17.2176 55.3603 23.9709 63.3779 52.3136 2.5118 3.4812 345.2581 3.9811 4.8781 71.3383 137.7176 0.0842 0.0390 15.3352 57.0049 31.6472 2.1072 21.7283 52.5868 20.1907 20.2420 11.2752 11.7204 33.9175 7.7603 51.4062 4.1902 319.4216 25.8065 137.2540 56.1310 49.0801 37.4487 32.6601 23.6069 44.5916 35.3602 32.4517 29.8320 27.0467 49.0234 26.7814 16.8412 2.5582 73.6182 32.5936
temp: 298.150 k
press: 1.00000 atm
elementType: 8 8 7 6 6 6 6 6 6 6 6 6 6 1 1 1 1 1 1 1 1 1 1 1 1 1 1 1
symmnumber: 1
zpe: 612880.6 jmol-1
zpe.correction: 0.233434 hartree
zpe.thermalcorrener: 0.247735 hartree
zpe.thermalcorrenthalpy: 0.248680 hartree
zpe.thermalcorrgfe: 0.192353 hartree
zpe.sumelectzpe: -594.245822 hartree
zpe.sumelectthermal: -594.231521 hartree
zpe.sumelectthermalent: -594.230577 hartree
zpe.sumelectthermalfe: -594.286904 hartree
dipole: -0.5701 0.2909 0.0180
dipole: 0.6403
quadrupole: -62.1307 -66.9756 -82.6970
quadrupole: 3.1722 -0.0096 0.0322
quadrupole: 8.4704 3.6255 -12.0959 3.1722 -0.0096 0.0322
hfenergy: -594.4792564 hartree
pointgroup: C01 [X(C10H15N1O2)]
dipole: 0.2230125 0.1163017 -0.014377 debye
polarizability: 180.7717802|4.3065467|135.6990191|-1.7260567|-2.224192|70.8710562 unknown
InChI: InChI=1S/C10H15NO2/c1-3-12-8-5-6-9(11)10(7-8)13-4-2/h5-7H,3-4,11H2,1-2H3
charge 0 multiplicity 1
28 atoms
O  2.498912 -0.32583 0.178329
O  -2.352293 -0.881666 0.267767
N  2.297845 2.338631 0.095524
C  1.179026 0.177804 0.180995
C  -1.256907 0.011869 0.220417
C  1.107684 1.609157 0.134571
C  0.018284 -0.610923 0.223588
C  -1.357203 1.41864 0.173559
C  -0.175657 2.201401 0.131577
C  2.672241 -1.787268 0.221012
C  -3.698778 -0.290831 0.263774
C  4.173617 -2.063367 0.202255
C  -4.69218 -1.449079 0.330282
H  0.057206 -1.702742 0.260314
H  -2.327801 1.922053 0.169182
H  -0.257564 3.294479 0.096241
H  2.199902 -2.185389 1.142714
H  2.167597 -2.241899 -0.656379
H  -3.812916 0.385141 1.137739
H  -3.841599 0.307726 -0.660908
H  4.35866 -3.152462 0.236444
H  4.633448 -1.660285 -0.716486
H  4.667047 -1.598501 1.073137
H  -5.728409 -1.064033 0.332845
H  -4.568313 -2.11758 -0.53896
H  -4.535522 -2.041481 1.24801
H  3.179941 1.835356 0.096979
H  2.290433 3.351879 0.058577
