program: Orca
programVersion: 5.0.2
elementType: S S S P O O C C C C C C C C C H H H H H H H H H H H H H H H H H H H H H
charge: 0
multiplicity: 1
keywords: wb97x-d3
keywords: def2-TZVPP
keywords: def2/J RIJCOSX
keywords: DEFGRID2
keywords: scfconv7
keywords: smallprint printgap noloewdin
keywords: NOSOSCF
formula: C9H21O2PS3
InChI: InChI=1/C9H21O2PS3/c1-6-10-12(13,11-7-2)15-8-14-9(3,4)5/h6-8H2,1-5H3
36 atoms
S  2.088755 0.03218 -0.970439
S  0.073651 -1.704686 0.608508
S  -1.580686 -0.063463 -1.886682
P  -1.273137 -0.233043 0.011312
O  -2.466554 -0.762677 0.934634
O  -0.836557 1.12196 0.748215
C  3.481952 0.0684 0.236956
C  4.043123 1.48036 0.093146
C  2.997054 -0.156717 1.660877
C  4.540199 -0.957378 -0.143984
C  1.311728 -1.568005 -0.727412
C  -3.724225 -0.06114 1.044643
C  -0.538049 2.357582 0.072542
C  -4.761961 -0.654543 0.124523
C  -1.759633 3.237804 -0.010587
H  4.378848 1.684089 -0.925194
H  3.306415 2.236586 0.368979
H  4.904141 1.597019 0.753874
H  2.198018 0.534565 1.929184
H  3.828293 -0.00154 2.353164
H  2.631914 -1.171904 1.814994
H  5.37833 -0.898747 0.554632
H  4.159487 -1.978883 -0.101792
H  4.925835 -0.779903 -1.147887
H  0.82752 -1.832193 -1.666581
H  2.047326 -2.343647 -0.512854
H  -4.021581 -0.167121 2.087187
H  -3.592332 1.005572 0.849877
H  0.248993 2.826415 0.66219
H  -0.133018 2.154331 -0.918561
H  -4.876933 -1.72568 0.291342
H  -5.723821 -0.18152 0.324015
H  -4.514399 -0.487859 -0.922855
H  -2.538187 2.781872 -0.622961
H  -2.171249 3.452784 0.975695
H  -1.486099 4.187114 -0.472561
elementType: S P O C H
totalener: -2042.18538505 hartree
nucrepener: 1730.27019418 hartree
electener: -3772.45557922 hartree
oneelecener: -6256.25524879 hartree
twoeener: 2483.79966957 hartree
cpcmener: -0.02022765 hartree
kineticenergy: 2036.97997923 hartree
xcener: -124.862914538492 hartree
chargesum: 0.0000000
charge: -0.181939 -0.157609 -0.463490 0.655642 -0.355380 -0.356664 0.201933 -0.297837 -0.329920 -0.321319 -0.143847 0.029355 0.072208 -0.241156 -0.263471 0.104567 0.105849 0.100336 0.097448 0.106039 0.093458 0.099996 0.102407 0.096328 0.158719 0.157210 0.108120 0.098820 0.107098 0.082191 0.089323 0.095950 0.075189 0.076067 0.093505 0.104873
qa: -0.1819 -0.1576 -0.4635 0.6556 -0.3554 -0.3567 0.2019 -0.2978 -0.3299 -0.3213 -0.1438 0.0294 0.0722 -0.2412 -0.2635 0.1046 0.1058 0.1003 0.0974 0.1060 0.0935 0.1000 0.1024 0.0963 0.1587 0.1572 0.1081 0.0988 0.1071 0.0822 0.0893 0.0960 0.0752 0.0761 0.0935 0.1049
va: 2.2344 2.2982 1.9641 5.4070 2.1001 2.0495 3.8490 3.8744 3.9322 3.9329 3.9804 3.8932 3.7980 3.9184 3.9540 1.0094 1.0077 1.0043 1.0127 1.0065 1.0024 1.0028 1.0039 1.0134 1.0191 1.0042 0.9931 0.9857 0.9911 1.0175 1.0044 1.0082 1.0208 1.0125 1.0023 1.0095
dispcorr: -0.018400045 hartree
energy: -2042.203785090040
dipole: 10.02585 -9.33090 0.69496 10.55651 -9.75494 0.80157 6.10920 -4.94192 1.16728
magnitude: 1.57735 au
magnitude: 4.00930 debye
