program: Orca
programVersion: 5.0.2
elementType: S S S P O O C C C C C C C C C H H H H H H H H H H H H H H H H H H H H H
charge: 0
multiplicity: 1
keywords: wb97x-d3
keywords: def2-TZVPP
keywords: def2/J RIJCOSX
keywords: DEFGRID2
keywords: scfconv7
keywords: smallprint printgap noloewdin
keywords: NOSOSCF
formula: C9H21O2PS3
InChI: InChI=1/C9H21O2PS3/c1-6-10-12(13,11-7-2)15-8-14-9(3,4)5/h6-8H2,1-5H3
36 atoms
S  2.107204 0.061446 -0.951298
S  0.079255 -1.688663 0.596114
S  -1.593911 -0.058865 -1.892356
P  -1.285048 -0.23113 0.005201
O  -2.471818 -0.778003 0.926929
O  -0.861577 1.12628 0.745191
C  3.513136 0.048194 0.242987
C  4.094945 1.454463 0.129331
C  3.038308 -0.206076 1.66533
C  4.552544 -0.982585 -0.174342
C  1.313924 -1.535834 -0.740705
C  -3.72603 -0.076962 1.070239
C  -0.575028 2.365816 0.071377
C  -4.775704 -0.642693 0.146325
C  -1.804893 3.234551 -0.01124
H  4.422328 1.679219 -0.887315
H  3.374357 2.215067 0.433589
H  4.965497 1.540214 0.782326
H  2.658694 -1.21921 1.796885
H  2.252968 0.490448 1.95915
H  3.878256 -0.082216 2.353447
H  4.933642 -0.783038 -1.175823
H  5.39661 -0.956087 0.519082
H  4.156841 -1.999077 -0.157566
H  0.823874 -1.775253 -1.6836
H  2.042175 -2.323403 -0.545592
H  -4.011548 -0.210839 2.112927
H  -3.593528 0.9943 0.903088
H  0.206705 2.841843 0.662028
H  -0.167684 2.168056 -0.919973
H  -5.734378 -0.174775 0.371449
H  -4.541004 -0.446105 -0.898832
H  -4.889844 -1.718083 0.283802
H  -2.579562 2.771723 -0.623316
H  -2.217824 3.44563 0.975336
H  -1.54018 4.186431 -0.473084
elementType: S P O C H
totalener: -2042.18556271 hartree
nucrepener: 1726.87940394 hartree
electener: -3769.06496665 hartree
oneelecener: -6249.47658931 hartree
twoeener: 2480.41162266 hartree
cpcmener: -0.02023727 hartree
kineticenergy: 2036.97710444 hartree
xcener: -124.862173307525 hartree
chargesum: 0.0000000
charge: -0.182246 -0.156862 -0.463246 0.654035 -0.354698 -0.356566 0.201783 -0.296740 -0.329108 -0.322359 -0.145380 0.029171 0.071908 -0.240546 -0.263142 0.104398 0.105647 0.100129 0.093399 0.097686 0.105662 0.096354 0.100067 0.102538 0.159227 0.157639 0.108103 0.098963 0.107431 0.081818 0.096053 0.074872 0.089332 0.076152 0.093427 0.105100
qa: -0.1822 -0.1569 -0.4632 0.6540 -0.3547 -0.3566 0.2018 -0.2967 -0.3291 -0.3224 -0.1454 0.0292 0.0719 -0.2405 -0.2631 0.1044 0.1056 0.1001 0.0934 0.0977 0.1057 0.0964 0.1001 0.1025 0.1592 0.1576 0.1081 0.0990 0.1074 0.0818 0.0961 0.0749 0.0893 0.0762 0.0934 0.1051
va: 2.2351 2.3006 1.9652 5.4089 2.1018 2.0496 3.8509 3.8734 3.9318 3.9337 3.9816 3.8931 3.7993 3.9178 3.9513 1.0095 1.0081 1.0043 1.0019 1.0132 1.0066 1.0134 1.0028 1.0039 1.0196 1.0038 0.9930 0.9857 0.9916 1.0174 1.0083 1.0205 1.0044 1.0126 1.0022 1.0096
dispcorr: -0.018275499 hartree
energy: -2042.203838211552
dipole: 10.08802 -9.40279 0.68523 10.31002 -9.52455 0.78547 6.19733 -5.01554 1.18179
magnitude: 1.57579 au
magnitude: 4.00535 debye
